[ovs-build] |fail| pw1551374 [ovs-dev] [PATCH ovn v9 2/4] ovn-controller: Prepare VIF plug provider infrastructure.

0-day Robot robot at bytheb.org
Fri Nov 5 15:58:39 UTC 2021


From: robot at bytheb.org

Test-Label: github-robot: Build and Test
Test-Status: fail
http://patchwork.ozlabs.org/api/patches/1551374/

_github build: failed_
Build URL: https://github.com/ovsrobot/ovn/actions/runs/1425913645
Build Logs:
-----------------------Summary of failed steps-----------------------
"osx clang --disable-ssl" failed at step build
"linux gcc --disable-ssl" failed at step build
"linux clang --disable-ssl" failed at step build
"linux gcc system-test" failed at step build
"linux clang test asan" failed at step build
"linux gcc test -ljemalloc" failed at step build
"linux clang test -ljemalloc" failed at step build
"linux gcc m32 --disable-ssl" failed at step build
----------------------End summary of failed steps--------------------

-------------------------------BEGIN LOGS----------------------------
####################################################################################
#### [Begin job log] "osx clang --disable-ssl" at step build
####################################################################################
#define HAVE_PRAGMA_MESSAGE 1

configure: exit 0

## ---------------------- ##
## Running config.status. ##
## ---------------------- ##

This file was extended by ovn config.status 21.09.90, which was
generated by GNU Autoconf 2.71.  Invocation command line was

  CONFIG_FILES    = 
  CONFIG_HEADERS  = 
  CONFIG_LINKS    = 
  CONFIG_COMMANDS = 
  $ ./config.status Makefile depfiles

on Mac-1636119621401.local

config.status:1309: creating Makefile
config.status:1538: executing depfiles commands
config.status:1640: cd .       && sed -e '/# am--include-marker/d' Makefile         | make -f - am--depfiles
make[1]: Nothing to be done for `am--depfiles'.
config.status:1645: $? = 0
##[error]Process completed with exit code 1.
####################################################################################
#### [End job log] "osx clang --disable-ssl" at step build
####################################################################################




####################################################################################
#### [Begin job log] "linux gcc --disable-ssl" at step build
####################################################################################

## ---------------------- ##
## Running config.status. ##
## ---------------------- ##

This file was extended by ovn config.status 21.09.90, which was
generated by GNU Autoconf 2.69.  Invocation command line was

  CONFIG_FILES    = 
  CONFIG_HEADERS  = 
  CONFIG_LINKS    = 
  CONFIG_COMMANDS = 
  $ ./config.status Makefile depfiles

on fv-az121-771

config.status:1310: creating Makefile
config.status:1539: executing depfiles commands
config.status:1639: cd .       && sed -e '/# am--include-marker/d' Makefile         | make -f - am--depfiles
make[1]: warning: jobserver unavailable: using -j1.  Add '+' to parent make rule.
make[1]: Entering directory '/home/runner/work/ovn/ovn'
make[1]: Nothing to be done for 'am--depfiles'.
make[1]: Leaving directory '/home/runner/work/ovn/ovn'
config.status:1644: $? = 0
##[error]Process completed with exit code 1.
####################################################################################
#### [End job log] "linux gcc --disable-ssl" at step build
####################################################################################




####################################################################################
#### [Begin job log] "linux clang --disable-ssl" at step build
####################################################################################

## ---------------------- ##
## Running config.status. ##
## ---------------------- ##

This file was extended by ovn config.status 21.09.90, which was
generated by GNU Autoconf 2.69.  Invocation command line was

  CONFIG_FILES    = 
  CONFIG_HEADERS  = 
  CONFIG_LINKS    = 
  CONFIG_COMMANDS = 
  $ ./config.status Makefile depfiles

on fv-az93-722

config.status:1311: creating Makefile
config.status:1540: executing depfiles commands
config.status:1640: cd .       && sed -e '/# am--include-marker/d' Makefile         | make -f - am--depfiles
make[1]: warning: jobserver unavailable: using -j1.  Add '+' to parent make rule.
make[1]: Entering directory '/home/runner/work/ovn/ovn'
make[1]: Nothing to be done for 'am--depfiles'.
make[1]: Leaving directory '/home/runner/work/ovn/ovn'
config.status:1645: $? = 0
##[error]Process completed with exit code 1.
####################################################################################
#### [End job log] "linux clang --disable-ssl" at step build
####################################################################################




####################################################################################
#### [Begin job log] "linux gcc system-test" at step build
####################################################################################
depbase=`echo controller/mac-learn.o | sed 's|[^/]*$|.deps/&|;s|\.o$||'`;\
env REAL_CC="gcc" CHECK="sparse -Wsparse-error -I /home/runner/work/ovn/ovn/ovs/include/sparse -m64 -I /usr/local/include -I /usr/include/x86_64-linux-gnu  " cgcc -target=x86_64 -DHAVE_CONFIG_H -I. -I../..   -I ../../include  -I ../../include -I ../../ovn -I ./include -I ../../lib -I ./lib -I /home/runner/work/ovn/ovn/ovs/include -I /home/runner/work/ovn/ovn/ovs/include -I /home/runner/work/ovn/ovn/ovs/lib -I /home/runner/work/ovn/ovn/ovs/lib -I /home/runner/work/ovn/ovn/ovs -I /home/runner/work/ovn/ovn/ovs    -Wstrict-prototypes -Wall -Wextra -Wno-sign-compare -Wpointer-arith -Wformat -Wformat-security -Wswitch-enum -Wunused-parameter -Wbad-function-cast -Wcast-align -Wstrict-prototypes -Wold-style-definition -Wmissing-prototypes -Wmissing-field-initializers -fno-strict-aliasing -Wswitch-bool -Wlogical-not-parentheses -Wsizeof-array-argument -Wbool-compare -Wshift-negative-value -Wduplicated-cond -Wshadow -Wmultistatement-macros -Wcast-align=strict -Werror -Werror  -g -O2 -MT controller/mac-learn.o -MD -MP -MF $depbase.Tpo -c -o controller/mac-learn.o ../../controller/mac-learn.c &&\
mv -f $depbase.Tpo $depbase.Po
depbase=`echo controller/local_data.o | sed 's|[^/]*$|.deps/&|;s|\.o$||'`;\
env REAL_CC="gcc" CHECK="sparse -Wsparse-error -I /home/runner/work/ovn/ovn/ovs/include/sparse -m64 -I /usr/local/include -I /usr/include/x86_64-linux-gnu  " cgcc -target=x86_64 -DHAVE_CONFIG_H -I. -I../..   -I ../../include  -I ../../include -I ../../ovn -I ./include -I ../../lib -I ./lib -I /home/runner/work/ovn/ovn/ovs/include -I /home/runner/work/ovn/ovn/ovs/include -I /home/runner/work/ovn/ovn/ovs/lib -I /home/runner/work/ovn/ovn/ovs/lib -I /home/runner/work/ovn/ovn/ovs -I /home/runner/work/ovn/ovn/ovs    -Wstrict-prototypes -Wall -Wextra -Wno-sign-compare -Wpointer-arith -Wformat -Wformat-security -Wswitch-enum -Wunused-parameter -Wbad-function-cast -Wcast-align -Wstrict-prototypes -Wold-style-definition -Wmissing-prototypes -Wmissing-field-initializers -fno-strict-aliasing -Wswitch-bool -Wlogical-not-parentheses -Wsizeof-array-argument -Wbool-compare -Wshift-negative-value -Wduplicated-cond -Wshadow -Wmultistatement-macros -Wcast-align=strict -Werror -Werror  -g -O2 -MT controller/local_data.o -MD -MP -MF $depbase.Tpo -c -o controller/local_data.o ../../controller/local_data.c &&\
mv -f $depbase.Tpo $depbase.Po
depbase=`echo controller/ovsport.o | sed 's|[^/]*$|.deps/&|;s|\.o$||'`;\
env REAL_CC="gcc" CHECK="sparse -Wsparse-error -I /home/runner/work/ovn/ovn/ovs/include/sparse -m64 -I /usr/local/include -I /usr/include/x86_64-linux-gnu  " cgcc -target=x86_64 -DHAVE_CONFIG_H -I. -I../..   -I ../../include  -I ../../include -I ../../ovn -I ./include -I ../../lib -I ./lib -I /home/runner/work/ovn/ovn/ovs/include -I /home/runner/work/ovn/ovn/ovs/include -I /home/runner/work/ovn/ovn/ovs/lib -I /home/runner/work/ovn/ovn/ovs/lib -I /home/runner/work/ovn/ovn/ovs -I /home/runner/work/ovn/ovn/ovs    -Wstrict-prototypes -Wall -Wextra -Wno-sign-compare -Wpointer-arith -Wformat -Wformat-security -Wswitch-enum -Wunused-parameter -Wbad-function-cast -Wcast-align -Wstrict-prototypes -Wold-style-definition -Wmissing-prototypes -Wmissing-field-initializers -fno-strict-aliasing -Wswitch-bool -Wlogical-not-parentheses -Wsizeof-array-argument -Wbool-compare -Wshift-negative-value -Wduplicated-cond -Wshadow -Wmultistatement-macros -Wcast-align=strict -Werror -Werror  -g -O2 -MT controller/ovsport.o -MD -MP -MF $depbase.Tpo -c -o controller/ovsport.o ../../controller/ovsport.c &&\
mv -f $depbase.Tpo $depbase.Po
depbase=`echo controller/vif-plug.o | sed 's|[^/]*$|.deps/&|;s|\.o$||'`;\
env REAL_CC="gcc" CHECK="sparse -Wsparse-error -I /home/runner/work/ovn/ovn/ovs/include/sparse -m64 -I /usr/local/include -I /usr/include/x86_64-linux-gnu  " cgcc -target=x86_64 -DHAVE_CONFIG_H -I. -I../..   -I ../../include  -I ../../include -I ../../ovn -I ./include -I ../../lib -I ./lib -I /home/runner/work/ovn/ovn/ovs/include -I /home/runner/work/ovn/ovn/ovs/include -I /home/runner/work/ovn/ovn/ovs/lib -I /home/runner/work/ovn/ovn/ovs/lib -I /home/runner/work/ovn/ovn/ovs -I /home/runner/work/ovn/ovn/ovs    -Wstrict-prototypes -Wall -Wextra -Wno-sign-compare -Wpointer-arith -Wformat -Wformat-security -Wswitch-enum -Wunused-parameter -Wbad-function-cast -Wcast-align -Wstrict-prototypes -Wold-style-definition -Wmissing-prototypes -Wmissing-field-initializers -fno-strict-aliasing -Wswitch-bool -Wlogical-not-parentheses -Wsizeof-array-argument -Wbool-compare -Wshift-negative-value -Wduplicated-cond -Wshadow -Wmultistatement-macros -Wcast-align=strict -Werror -Werror  -g -O2 -MT controller/vif-plug.o -MD -MP -MF $depbase.Tpo -c -o controller/vif-plug.o ../../controller/vif-plug.c &&\
mv -f $depbase.Tpo $depbase.Po
depbase=`echo controller-vtep/binding.o | sed 's|[^/]*$|.deps/&|;s|\.o$||'`;\
env REAL_CC="gcc" CHECK="sparse -Wsparse-error -I /home/runner/work/ovn/ovn/ovs/include/sparse -m64 -I /usr/local/include -I /usr/include/x86_64-linux-gnu  " cgcc -target=x86_64 -DHAVE_CONFIG_H -I. -I../..   -I ../../include  -I ../../include -I ../../ovn -I ./include -I ../../lib -I ./lib -I /home/runner/work/ovn/ovn/ovs/include -I /home/runner/work/ovn/ovn/ovs/include -I /home/runner/work/ovn/ovn/ovs/lib -I /home/runner/work/ovn/ovn/ovs/lib -I /home/runner/work/ovn/ovn/ovs -I /home/runner/work/ovn/ovn/ovs    -Wstrict-prototypes -Wall -Wextra -Wno-sign-compare -Wpointer-arith -Wformat -Wformat-security -Wswitch-enum -Wunused-parameter -Wbad-function-cast -Wcast-align -Wstrict-prototypes -Wold-style-definition -Wmissing-prototypes -Wmissing-field-initializers -fno-strict-aliasing -Wswitch-bool -Wlogical-not-parentheses -Wsizeof-array-argument -Wbool-compare -Wshift-negative-value -Wduplicated-cond -Wshadow -Wmultistatement-macros -Wcast-align=strict -Werror -Werror  -g -O2 -MT controller-vtep/binding.o -MD -MP -MF $depbase.Tpo -c -o controller-vtep/binding.o ../../controller-vtep/binding.c &&\
mv -f $depbase.Tpo $depbase.Po
cc1: all warnings being treated as errors
make[2]: *** [Makefile:2264: controller/ovn-controller.o] Error 1
make[2]: *** Waiting for unfinished jobs....
make[2]: Leaving directory '/home/runner/work/ovn/ovn/ovn-21.09.90/_build/sub'
make[1]: *** [Makefile:1495: all] Error 2
make[1]: Leaving directory '/home/runner/work/ovn/ovn/ovn-21.09.90/_build/sub'
make: *** [Makefile:2754: distcheck] Error 1
+ cat '*/_build/sub/tests/testsuite.log'
cat: '*/_build/sub/tests/testsuite.log': No such file or directory
##[error]Process completed with exit code 1.
####################################################################################
#### [End job log] "linux gcc system-test" at step build
####################################################################################




####################################################################################
#### [Begin job log] "linux clang test asan" at step build
####################################################################################
depbase=`echo controller/pinctrl.o | sed 's|[^/]*$|.deps/&|;s|\.o$||'`;\
clang -DHAVE_CONFIG_H -I. -I../..   -I ../../include  -I ../../include -I ../../ovn -I ./include -I ../../lib -I ./lib -I /home/runner/work/ovn/ovn/ovs/include -I /home/runner/work/ovn/ovn/ovs/include -I /home/runner/work/ovn/ovn/ovs/lib -I /home/runner/work/ovn/ovn/ovs/lib -I /home/runner/work/ovn/ovn/ovs -I /home/runner/work/ovn/ovn/ovs    -Wstrict-prototypes -Wall -Wextra -Wno-sign-compare -Wpointer-arith -Wformat -Wformat-security -Wswitch-enum -Wunused-parameter -Wbad-function-cast -Wcast-align -Wstrict-prototypes -Wold-style-definition -Wmissing-prototypes -Wmissing-field-initializers -Wthread-safety -fno-strict-aliasing -Wswitch-bool -Wlogical-not-parentheses -Wsizeof-array-argument -Wshift-negative-value -Qunused-arguments -Wshadow -Wno-null-pointer-arithmetic -Warray-bounds-pointer-arithmetic -fno-omit-frame-pointer -fno-common -Wno-error=unused-command-line-argument -fsanitize=address -Werror -Werror  -g -O2 -MT controller/pinctrl.o -MD -MP -MF $depbase.Tpo -c -o controller/pinctrl.o ../../controller/pinctrl.c &&\
mv -f $depbase.Tpo $depbase.Po
depbase=`echo controller/patch.o | sed 's|[^/]*$|.deps/&|;s|\.o$||'`;\
clang -DHAVE_CONFIG_H -I. -I../..   -I ../../include  -I ../../include -I ../../ovn -I ./include -I ../../lib -I ./lib -I /home/runner/work/ovn/ovn/ovs/include -I /home/runner/work/ovn/ovn/ovs/include -I /home/runner/work/ovn/ovn/ovs/lib -I /home/runner/work/ovn/ovn/ovs/lib -I /home/runner/work/ovn/ovn/ovs -I /home/runner/work/ovn/ovn/ovs    -Wstrict-prototypes -Wall -Wextra -Wno-sign-compare -Wpointer-arith -Wformat -Wformat-security -Wswitch-enum -Wunused-parameter -Wbad-function-cast -Wcast-align -Wstrict-prototypes -Wold-style-definition -Wmissing-prototypes -Wmissing-field-initializers -Wthread-safety -fno-strict-aliasing -Wswitch-bool -Wlogical-not-parentheses -Wsizeof-array-argument -Wshift-negative-value -Qunused-arguments -Wshadow -Wno-null-pointer-arithmetic -Warray-bounds-pointer-arithmetic -fno-omit-frame-pointer -fno-common -Wno-error=unused-command-line-argument -fsanitize=address -Werror -Werror  -g -O2 -MT controller/patch.o -MD -MP -MF $depbase.Tpo -c -o controller/patch.o ../../controller/patch.c &&\
mv -f $depbase.Tpo $depbase.Po
depbase=`echo controller/ovn-controller.o | sed 's|[^/]*$|.deps/&|;s|\.o$||'`;\
clang -DHAVE_CONFIG_H -I. -I../..   -I ../../include  -I ../../include -I ../../ovn -I ./include -I ../../lib -I ./lib -I /home/runner/work/ovn/ovn/ovs/include -I /home/runner/work/ovn/ovn/ovs/include -I /home/runner/work/ovn/ovn/ovs/lib -I /home/runner/work/ovn/ovn/ovs/lib -I /home/runner/work/ovn/ovn/ovs -I /home/runner/work/ovn/ovn/ovs    -Wstrict-prototypes -Wall -Wextra -Wno-sign-compare -Wpointer-arith -Wformat -Wformat-security -Wswitch-enum -Wunused-parameter -Wbad-function-cast -Wcast-align -Wstrict-prototypes -Wold-style-definition -Wmissing-prototypes -Wmissing-field-initializers -Wthread-safety -fno-strict-aliasing -Wswitch-bool -Wlogical-not-parentheses -Wsizeof-array-argument -Wshift-negative-value -Qunused-arguments -Wshadow -Wno-null-pointer-arithmetic -Warray-bounds-pointer-arithmetic -fno-omit-frame-pointer -fno-common -Wno-error=unused-command-line-argument -fsanitize=address -Werror -Werror  -g -O2 -MT controller/ovn-controller.o -MD -MP -MF $depbase.Tpo -c -o controller/ovn-controller.o ../../controller/ovn-controller.c &&\
mv -f $depbase.Tpo $depbase.Po
../../controller/ovn-controller.c:3094:29: error: unused variable 'ovsrec_port_by_interfaces' [-Werror,-Wunused-variable]
    struct ovsdb_idl_index *ovsrec_port_by_interfaces
                            ^
../../controller/ovn-controller.c:3133:29: error: unused variable 'sbrec_port_binding_by_requested_chassis' [-Werror,-Wunused-variable]
    struct ovsdb_idl_index *sbrec_port_binding_by_requested_chassis
                            ^
2 errors generated.
make[2]: *** [Makefile:2264: controller/ovn-controller.o] Error 1
make[2]: *** Waiting for unfinished jobs....
make[2]: Leaving directory '/home/runner/work/ovn/ovn/ovn-21.09.90/_build/sub'
make[1]: Leaving directory '/home/runner/work/ovn/ovn/ovn-21.09.90/_build/sub'
make[1]: *** [Makefile:1495: all] Error 2
make: *** [Makefile:2754: distcheck] Error 1
+ cat '*/_build/sub/tests/testsuite.log'
cat: '*/_build/sub/tests/testsuite.log': No such file or directory
##[error]Process completed with exit code 1.
####################################################################################
#### [End job log] "linux clang test asan" at step build
####################################################################################




####################################################################################
#### [Begin job log] "linux gcc test -ljemalloc" at step build
####################################################################################
depbase=`echo controller/ovsport.o | sed 's|[^/]*$|.deps/&|;s|\.o$||'`;\
env REAL_CC="gcc" CHECK="sparse -Wsparse-error -I /home/runner/work/ovn/ovn/ovs/include/sparse -m64 -I /usr/local/include -I /usr/include/x86_64-linux-gnu  " cgcc -target=x86_64 -DHAVE_CONFIG_H -I. -I../..   -I ../../include  -I ../../include -I ../../ovn -I ./include -I ../../lib -I ./lib -I /home/runner/work/ovn/ovn/ovs/include -I /home/runner/work/ovn/ovn/ovs/include -I /home/runner/work/ovn/ovn/ovs/lib -I /home/runner/work/ovn/ovn/ovs/lib -I /home/runner/work/ovn/ovn/ovs -I /home/runner/work/ovn/ovn/ovs    -Wstrict-prototypes -Wall -Wextra -Wno-sign-compare -Wpointer-arith -Wformat -Wformat-security -Wswitch-enum -Wunused-parameter -Wbad-function-cast -Wcast-align -Wstrict-prototypes -Wold-style-definition -Wmissing-prototypes -Wmissing-field-initializers -fno-strict-aliasing -Wswitch-bool -Wlogical-not-parentheses -Wsizeof-array-argument -Wbool-compare -Wshift-negative-value -Wduplicated-cond -Wshadow -Wmultistatement-macros -Wcast-align=strict -Werror -Werror  -g -O2 -MT controller/ovsport.o -MD -MP -MF $depbase.Tpo -c -o controller/ovsport.o ../../controller/ovsport.c &&\
mv -f $depbase.Tpo $depbase.Po
depbase=`echo controller/vif-plug.o | sed 's|[^/]*$|.deps/&|;s|\.o$||'`;\
env REAL_CC="gcc" CHECK="sparse -Wsparse-error -I /home/runner/work/ovn/ovn/ovs/include/sparse -m64 -I /usr/local/include -I /usr/include/x86_64-linux-gnu  " cgcc -target=x86_64 -DHAVE_CONFIG_H -I. -I../..   -I ../../include  -I ../../include -I ../../ovn -I ./include -I ../../lib -I ./lib -I /home/runner/work/ovn/ovn/ovs/include -I /home/runner/work/ovn/ovn/ovs/include -I /home/runner/work/ovn/ovn/ovs/lib -I /home/runner/work/ovn/ovn/ovs/lib -I /home/runner/work/ovn/ovn/ovs -I /home/runner/work/ovn/ovn/ovs    -Wstrict-prototypes -Wall -Wextra -Wno-sign-compare -Wpointer-arith -Wformat -Wformat-security -Wswitch-enum -Wunused-parameter -Wbad-function-cast -Wcast-align -Wstrict-prototypes -Wold-style-definition -Wmissing-prototypes -Wmissing-field-initializers -fno-strict-aliasing -Wswitch-bool -Wlogical-not-parentheses -Wsizeof-array-argument -Wbool-compare -Wshift-negative-value -Wduplicated-cond -Wshadow -Wmultistatement-macros -Wcast-align=strict -Werror -Werror  -g -O2 -MT controller/vif-plug.o -MD -MP -MF $depbase.Tpo -c -o controller/vif-plug.o ../../controller/vif-plug.c &&\
mv -f $depbase.Tpo $depbase.Po
depbase=`echo controller-vtep/binding.o | sed 's|[^/]*$|.deps/&|;s|\.o$||'`;\
env REAL_CC="gcc" CHECK="sparse -Wsparse-error -I /home/runner/work/ovn/ovn/ovs/include/sparse -m64 -I /usr/local/include -I /usr/include/x86_64-linux-gnu  " cgcc -target=x86_64 -DHAVE_CONFIG_H -I. -I../..   -I ../../include  -I ../../include -I ../../ovn -I ./include -I ../../lib -I ./lib -I /home/runner/work/ovn/ovn/ovs/include -I /home/runner/work/ovn/ovn/ovs/include -I /home/runner/work/ovn/ovn/ovs/lib -I /home/runner/work/ovn/ovn/ovs/lib -I /home/runner/work/ovn/ovn/ovs -I /home/runner/work/ovn/ovn/ovs    -Wstrict-prototypes -Wall -Wextra -Wno-sign-compare -Wpointer-arith -Wformat -Wformat-security -Wswitch-enum -Wunused-parameter -Wbad-function-cast -Wcast-align -Wstrict-prototypes -Wold-style-definition -Wmissing-prototypes -Wmissing-field-initializers -fno-strict-aliasing -Wswitch-bool -Wlogical-not-parentheses -Wsizeof-array-argument -Wbool-compare -Wshift-negative-value -Wduplicated-cond -Wshadow -Wmultistatement-macros -Wcast-align=strict -Werror -Werror  -g -O2 -MT controller-vtep/binding.o -MD -MP -MF $depbase.Tpo -c -o controller-vtep/binding.o ../../controller-vtep/binding.c &&\
mv -f $depbase.Tpo $depbase.Po
depbase=`echo controller-vtep/gateway.o | sed 's|[^/]*$|.deps/&|;s|\.o$||'`;\
env REAL_CC="gcc" CHECK="sparse -Wsparse-error -I /home/runner/work/ovn/ovn/ovs/include/sparse -m64 -I /usr/local/include -I /usr/include/x86_64-linux-gnu  " cgcc -target=x86_64 -DHAVE_CONFIG_H -I. -I../..   -I ../../include  -I ../../include -I ../../ovn -I ./include -I ../../lib -I ./lib -I /home/runner/work/ovn/ovn/ovs/include -I /home/runner/work/ovn/ovn/ovs/include -I /home/runner/work/ovn/ovn/ovs/lib -I /home/runner/work/ovn/ovn/ovs/lib -I /home/runner/work/ovn/ovn/ovs -I /home/runner/work/ovn/ovn/ovs    -Wstrict-prototypes -Wall -Wextra -Wno-sign-compare -Wpointer-arith -Wformat -Wformat-security -Wswitch-enum -Wunused-parameter -Wbad-function-cast -Wcast-align -Wstrict-prototypes -Wold-style-definition -Wmissing-prototypes -Wmissing-field-initializers -fno-strict-aliasing -Wswitch-bool -Wlogical-not-parentheses -Wsizeof-array-argument -Wbool-compare -Wshift-negative-value -Wduplicated-cond -Wshadow -Wmultistatement-macros -Wcast-align=strict -Werror -Werror  -g -O2 -MT controller-vtep/gateway.o -MD -MP -MF $depbase.Tpo -c -o controller-vtep/gateway.o ../../controller-vtep/gateway.c &&\
mv -f $depbase.Tpo $depbase.Po
depbase=`echo controller-vtep/ovn-controller-vtep.o | sed 's|[^/]*$|.deps/&|;s|\.o$||'`;\
env REAL_CC="gcc" CHECK="sparse -Wsparse-error -I /home/runner/work/ovn/ovn/ovs/include/sparse -m64 -I /usr/local/include -I /usr/include/x86_64-linux-gnu  " cgcc -target=x86_64 -DHAVE_CONFIG_H -I. -I../..   -I ../../include  -I ../../include -I ../../ovn -I ./include -I ../../lib -I ./lib -I /home/runner/work/ovn/ovn/ovs/include -I /home/runner/work/ovn/ovn/ovs/include -I /home/runner/work/ovn/ovn/ovs/lib -I /home/runner/work/ovn/ovn/ovs/lib -I /home/runner/work/ovn/ovn/ovs -I /home/runner/work/ovn/ovn/ovs    -Wstrict-prototypes -Wall -Wextra -Wno-sign-compare -Wpointer-arith -Wformat -Wformat-security -Wswitch-enum -Wunused-parameter -Wbad-function-cast -Wcast-align -Wstrict-prototypes -Wold-style-definition -Wmissing-prototypes -Wmissing-field-initializers -fno-strict-aliasing -Wswitch-bool -Wlogical-not-parentheses -Wsizeof-array-argument -Wbool-compare -Wshift-negative-value -Wduplicated-cond -Wshadow -Wmultistatement-macros -Wcast-align=strict -Werror -Werror  -g -O2 -MT controller-vtep/ovn-controller-vtep.o -MD -MP -MF $depbase.Tpo -c -o controller-vtep/ovn-controller-vtep.o ../../controller-vtep/ovn-controller-vtep.c &&\
mv -f $depbase.Tpo $depbase.Po
cc1: all warnings being treated as errors
make[2]: *** [Makefile:2264: controller/ovn-controller.o] Error 1
make[2]: *** Waiting for unfinished jobs....
make[2]: Leaving directory '/home/runner/work/ovn/ovn/ovn-21.09.90/_build/sub'
make[1]: *** [Makefile:1495: all] Error 2
make[1]: Leaving directory '/home/runner/work/ovn/ovn/ovn-21.09.90/_build/sub'
make: *** [Makefile:2754: distcheck] Error 1
+ cat '*/_build/sub/tests/testsuite.log'
cat: '*/_build/sub/tests/testsuite.log': No such file or directory
##[error]Process completed with exit code 1.
####################################################################################
#### [End job log] "linux gcc test -ljemalloc" at step build
####################################################################################




####################################################################################
#### [Begin job log] "linux clang test -ljemalloc" at step build
####################################################################################
../../controller/ovn-controller.c:3133:29: error: unused variable 'sbrec_port_binding_by_requested_chassis' [-Werror,-Wunused-variable]
    struct ovsdb_idl_index *sbrec_port_binding_by_requested_chassis
                            ^
2 errors generated.
make[2]: *** [Makefile:2264: controller/ovn-controller.o] Error 1
make[2]: *** Waiting for unfinished jobs....
Running Sphinx v4.2.0
Cannot find 'ovs-sphinx-theme' package. Falling back to default theme.
making output directory... done
loading pickled environment... done
building [mo]: targets for 0 po files that are out of date
building [man]: all manpages
updating environment: 0 added, 0 changed, 0 removed
looking for now-outdated files... none found
writing... ovn-sim.1 { } done
build succeeded.

The manual pages are in Documentation/_build/man.
make[2]: Leaving directory '/home/runner/work/ovn/ovn/ovn-21.09.90/_build/sub'
make[1]: *** [Makefile:1495: all] Error 2
make[1]: Leaving directory '/home/runner/work/ovn/ovn/ovn-21.09.90/_build/sub'
make: *** [Makefile:2754: distcheck] Error 1
+ cat '*/_build/sub/tests/testsuite.log'
cat: '*/_build/sub/tests/testsuite.log': No such file or directory
##[error]Process completed with exit code 1.
####################################################################################
#### [End job log] "linux clang test -ljemalloc" at step build
####################################################################################




####################################################################################
#### [Begin job log] "linux gcc m32 --disable-ssl" at step build
####################################################################################

## ---------------------- ##
## Running config.status. ##
## ---------------------- ##

This file was extended by ovn config.status 21.09.90, which was
generated by GNU Autoconf 2.69.  Invocation command line was

  CONFIG_FILES    = 
  CONFIG_HEADERS  = 
  CONFIG_LINKS    = 
  CONFIG_COMMANDS = 
  $ ./config.status Makefile depfiles

on fv-az93-722

config.status:1310: creating Makefile
config.status:1539: executing depfiles commands
config.status:1639: cd .       && sed -e '/# am--include-marker/d' Makefile         | make -f - am--depfiles
make[1]: warning: jobserver unavailable: using -j1.  Add '+' to parent make rule.
make[1]: Entering directory '/home/runner/work/ovn/ovn'
make[1]: Nothing to be done for 'am--depfiles'.
make[1]: Leaving directory '/home/runner/work/ovn/ovn'
config.status:1644: $? = 0
##[error]Process completed with exit code 1.
####################################################################################
#### [End job log] "linux gcc m32 --disable-ssl" at step build
####################################################################################
--------------------------------END LOGS-----------------------------


More information about the build mailing list