[ovs-build] |fail| pw1555197 [ovs-dev] [PATCH v2] conntrack: support default timeout policy get/set cmd for netdev datapath

0-day Robot robot at bytheb.org
Mon Nov 15 09:39:03 UTC 2021


From: robot at bytheb.org

Test-Label: github-robot: Build and Test
Test-Status: fail
http://patchwork.ozlabs.org/api/patches/1555197/

_github build: failed_
Build URL: https://github.com/ovsrobot/ovs/actions/runs/1461373666
Build Logs:
-----------------------Summary of failed steps-----------------------
"osx clang --disable-ssl" failed at step build
"linux gcc --disable-ssl" failed at step build
"linux clang --disable-ssl" failed at step build
"linux gcc afxdp 5.3" failed at step build
"linux clang afxdp 5.3" failed at step build
"linux gcc dpdk --enable-shared" failed at step build
"linux clang dpdk --enable-shared" failed at step build
"linux gcc dpdk-shared" failed at step build
"linux clang dpdk-shared" failed at step build
"linux gcc dpdk-shared --enable-shared" failed at step build
"linux clang dpdk-shared --enable-shared" failed at step build
"linux gcc m32 --disable-ssl" failed at step build
"linux gcc deb" failed at step build
----------------------End summary of failed steps--------------------

-------------------------------BEGIN LOGS----------------------------
####################################################################################
#### [Begin job log] "osx clang --disable-ssl" at step build
####################################################################################
/bin/sh '/Users/runner/work/ovs/ovs/build-aux/missing' autom4te --language=autotest -I '.' -o tests/system-dpdk-testsuite.tmp tests/system-dpdk-testsuite.at
mv tests/system-dpdk-testsuite.tmp tests/system-dpdk-testsuite
/bin/sh '/Users/runner/work/ovs/ovs/build-aux/missing' autom4te --language=autotest -I '.' -o tests/ovsdb-cluster-testsuite.tmp tests/ovsdb-cluster-testsuite.at
mv tests/ovsdb-cluster-testsuite.tmp tests/ovsdb-cluster-testsuite
\
	{ sed -n -e '/%AUTHORS%/q' -e p < ./debian/copyright.in;   \
	  sed '34,/^$/d' ./AUTHORS.rst |			   \
		sed -n -e '/^$/q' -e 's/^/  /p';			   \
	  sed -e '34,/%AUTHORS%/d' ./debian/copyright.in;	   \
	} > debian/copyright
(printf '\043 Generated automatically -- do not modify!    -*- buffer-read-only: t -*-\n' && sed -e 's,[@]VERSION[@],2.16.90,g') < ./rhel/openvswitch-dkms.spec.in > openvswitch-dkms.spec.tmp || exit 1; if cmp -s openvswitch-dkms.spec.tmp rhel/openvswitch-dkms.spec; then touch rhel/openvswitch-dkms.spec; rm openvswitch-dkms.spec.tmp; else mv openvswitch-dkms.spec.tmp rhel/openvswitch-dkms.spec; fi
(printf '\043 Generated automatically -- do not modify!    -*- buffer-read-only: t -*-\n' && sed -e 's,[@]VERSION[@],2.16.90,g') < ./rhel/kmod-openvswitch-rhel6.spec.in > kmod-openvswitch-rhel6.spec.tmp || exit 1; if cmp -s kmod-openvswitch-rhel6.spec.tmp rhel/kmod-openvswitch-rhel6.spec; then touch rhel/kmod-openvswitch-rhel6.spec; rm kmod-openvswitch-rhel6.spec.tmp; else mv kmod-openvswitch-rhel6.spec.tmp rhel/kmod-openvswitch-rhel6.spec; fi
(printf '\043 Generated automatically -- do not modify!    -*- buffer-read-only: t -*-\n' && sed -e 's,[@]VERSION[@],2.16.90,g') < ./rhel/openvswitch-kmod-fedora.spec.in > openvswitch-kmod-fedora.spec.tmp || exit 1; if cmp -s openvswitch-kmod-fedora.spec.tmp rhel/openvswitch-kmod-fedora.spec; then touch rhel/openvswitch-kmod-fedora.spec; rm openvswitch-kmod-fedora.spec.tmp; else mv openvswitch-kmod-fedora.spec.tmp rhel/openvswitch-kmod-fedora.spec; fi
(printf '\043 Generated automatically -- do not modify!    -*- buffer-read-only: t -*-\n' && sed -e 's,[@]VERSION[@],2.16.90,g') < ./rhel/openvswitch.spec.in > openvswitch.spec.tmp || exit 1; if cmp -s openvswitch.spec.tmp rhel/openvswitch.spec; then touch rhel/openvswitch.spec; rm openvswitch.spec.tmp; else mv openvswitch.spec.tmp rhel/openvswitch.spec; fi
(printf '\043 Generated automatically -- do not modify!    -*- buffer-read-only: t -*-\n' && sed -e 's,[@]VERSION[@],2.16.90,g') < ./rhel/openvswitch-fedora.spec.in > openvswitch-fedora.spec.tmp || exit 1; if cmp -s openvswitch-fedora.spec.tmp rhel/openvswitch-fedora.spec; then touch rhel/openvswitch-fedora.spec; rm openvswitch-fedora.spec.tmp; else mv openvswitch-fedora.spec.tmp rhel/openvswitch-fedora.spec; fi
(printf '\043 Generated automatically -- do not modify!    -*- buffer-read-only: t -*-\n' && sed -e 's,[@]VERSION[@],2.16.90,g') \
		< ./xenserver/openvswitch-xen.spec.in > openvswitch-xen.spec.tmp || exit 1; \
	if cmp -s openvswitch-xen.spec.tmp xenserver/openvswitch-xen.spec; then touch xenserver/openvswitch-xen.spec; rm openvswitch-xen.spec.tmp; else mv openvswitch-xen.spec.tmp xenserver/openvswitch-xen.spec; fi
tests/system-traffic.at
See above for files that use tabs for indentation.
Please use spaces instead.
make[2]: *** [check-tabs] Error 1
make[1]: *** [all-recursive] Error 1
make: *** [all] Error 2
##[error]Process completed with exit code 2.
####################################################################################
#### [End job log] "osx clang --disable-ssl" at step build
####################################################################################




####################################################################################
#### [Begin job log] "linux gcc --disable-ssl" at step build
####################################################################################
  sed -e '34,/%AUTHORS%/d' ./debian/copyright.in;	   \
} > debian/copyright
sed: couldn't write 52 items to stdout: Broken pipe
(printf '\043 Generated automatically -- do not modify!    -*- buffer-read-only: t -*-\n' && sed -e 's,[@]VERSION[@],2.16.90,g') < ./rhel/openvswitch-dkms.spec.in > openvswitch-dkms.spec.tmp || exit 1; if cmp -s openvswitch-dkms.spec.tmp rhel/openvswitch-dkms.spec; then touch rhel/openvswitch-dkms.spec; rm openvswitch-dkms.spec.tmp; else mv openvswitch-dkms.spec.tmp rhel/openvswitch-dkms.spec; fi
mv -f utilities/ovs-lib.tmp utilities/ovs-lib
(printf '\043 Generated automatically -- do not modify!    -*- buffer-read-only: t -*-\n' && sed -e 's,[@]VERSION[@],2.16.90,g') < ./rhel/kmod-openvswitch-rhel6.spec.in > kmod-openvswitch-rhel6.spec.tmp || exit 1; if cmp -s kmod-openvswitch-rhel6.spec.tmp rhel/kmod-openvswitch-rhel6.spec; then touch rhel/kmod-openvswitch-rhel6.spec; rm kmod-openvswitch-rhel6.spec.tmp; else mv kmod-openvswitch-rhel6.spec.tmp rhel/kmod-openvswitch-rhel6.spec; fi
(printf '\043 Generated automatically -- do not modify!    -*- buffer-read-only: t -*-\n' && sed -e 's,[@]VERSION[@],2.16.90,g') < ./rhel/openvswitch-kmod-fedora.spec.in > openvswitch-kmod-fedora.spec.tmp || exit 1; if cmp -s openvswitch-kmod-fedora.spec.tmp rhel/openvswitch-kmod-fedora.spec; then touch rhel/openvswitch-kmod-fedora.spec; rm openvswitch-kmod-fedora.spec.tmp; else mv openvswitch-kmod-fedora.spec.tmp rhel/openvswitch-kmod-fedora.spec; fi
(printf '\043 Generated automatically -- do not modify!    -*- buffer-read-only: t -*-\n' && sed -e 's,[@]VERSION[@],2.16.90,g') < ./rhel/openvswitch.spec.in > openvswitch.spec.tmp || exit 1; if cmp -s openvswitch.spec.tmp rhel/openvswitch.spec; then touch rhel/openvswitch.spec; rm openvswitch.spec.tmp; else mv openvswitch.spec.tmp rhel/openvswitch.spec; fi
(printf '\043 Generated automatically -- do not modify!    -*- buffer-read-only: t -*-\n' && sed -e 's,[@]VERSION[@],2.16.90,g') < ./rhel/openvswitch-fedora.spec.in > openvswitch-fedora.spec.tmp || exit 1; if cmp -s openvswitch-fedora.spec.tmp rhel/openvswitch-fedora.spec; then touch rhel/openvswitch-fedora.spec; rm openvswitch-fedora.spec.tmp; else mv openvswitch-fedora.spec.tmp rhel/openvswitch-fedora.spec; fi
(printf '\043 Generated automatically -- do not modify!    -*- buffer-read-only: t -*-\n' && sed -e 's,[@]VERSION[@],2.16.90,g') \
	< ./xenserver/openvswitch-xen.spec.in > openvswitch-xen.spec.tmp || exit 1; \
if cmp -s openvswitch-xen.spec.tmp xenserver/openvswitch-xen.spec; then touch xenserver/openvswitch-xen.spec; rm openvswitch-xen.spec.tmp; else mv openvswitch-xen.spec.tmp xenserver/openvswitch-xen.spec; fi
tests/system-traffic.at
make[2]: *** [check-tabs] Error 1
See above for files that use tabs for indentation.
Please use spaces instead.
Makefile:5786: recipe for target 'check-tabs' failed
make[2]: *** Waiting for unfinished jobs....
make[2]: Leaving directory '/home/runner/work/ovs/ovs'
Makefile:5144: recipe for target 'all-recursive' failed
make[1]: Leaving directory '/home/runner/work/ovs/ovs'
Makefile:2835: recipe for target 'all' failed
make[1]: *** [all-recursive] Error 1
make: *** [all] Error 2
##[error]Process completed with exit code 2.
####################################################################################
#### [End job log] "linux gcc --disable-ssl" at step build
####################################################################################




####################################################################################
#### [Begin job log] "linux clang --disable-ssl" at step build
####################################################################################
  sed -e '34,/%AUTHORS%/d' ./debian/copyright.in;	   \
} > debian/copyright
mv -f utilities/ovs-lib.tmp utilities/ovs-lib
(printf '\043 Generated automatically -- do not modify!    -*- buffer-read-only: t -*-\n' && sed -e 's,[@]VERSION[@],2.16.90,g') < ./rhel/openvswitch-dkms.spec.in > openvswitch-dkms.spec.tmp || exit 1; if cmp -s openvswitch-dkms.spec.tmp rhel/openvswitch-dkms.spec; then touch rhel/openvswitch-dkms.spec; rm openvswitch-dkms.spec.tmp; else mv openvswitch-dkms.spec.tmp rhel/openvswitch-dkms.spec; fi
(printf '\043 Generated automatically -- do not modify!    -*- buffer-read-only: t -*-\n' && sed -e 's,[@]VERSION[@],2.16.90,g') < ./rhel/kmod-openvswitch-rhel6.spec.in > kmod-openvswitch-rhel6.spec.tmp || exit 1; if cmp -s kmod-openvswitch-rhel6.spec.tmp rhel/kmod-openvswitch-rhel6.spec; then touch rhel/kmod-openvswitch-rhel6.spec; rm kmod-openvswitch-rhel6.spec.tmp; else mv kmod-openvswitch-rhel6.spec.tmp rhel/kmod-openvswitch-rhel6.spec; fi
(printf '\043 Generated automatically -- do not modify!    -*- buffer-read-only: t -*-\n' && sed -e 's,[@]VERSION[@],2.16.90,g') < ./rhel/openvswitch-kmod-fedora.spec.in > openvswitch-kmod-fedora.spec.tmp || exit 1; if cmp -s openvswitch-kmod-fedora.spec.tmp rhel/openvswitch-kmod-fedora.spec; then touch rhel/openvswitch-kmod-fedora.spec; rm openvswitch-kmod-fedora.spec.tmp; else mv openvswitch-kmod-fedora.spec.tmp rhel/openvswitch-kmod-fedora.spec; fi
(printf '\043 Generated automatically -- do not modify!    -*- buffer-read-only: t -*-\n' && sed -e 's,[@]VERSION[@],2.16.90,g') < ./rhel/openvswitch.spec.in > openvswitch.spec.tmp || exit 1; if cmp -s openvswitch.spec.tmp rhel/openvswitch.spec; then touch rhel/openvswitch.spec; rm openvswitch.spec.tmp; else mv openvswitch.spec.tmp rhel/openvswitch.spec; fi
(printf '\043 Generated automatically -- do not modify!    -*- buffer-read-only: t -*-\n' && sed -e 's,[@]VERSION[@],2.16.90,g') < ./rhel/openvswitch-fedora.spec.in > openvswitch-fedora.spec.tmp || exit 1; if cmp -s openvswitch-fedora.spec.tmp rhel/openvswitch-fedora.spec; then touch rhel/openvswitch-fedora.spec; rm openvswitch-fedora.spec.tmp; else mv openvswitch-fedora.spec.tmp rhel/openvswitch-fedora.spec; fi
(printf '\043 Generated automatically -- do not modify!    -*- buffer-read-only: t -*-\n' && sed -e 's,[@]VERSION[@],2.16.90,g') \
	< ./xenserver/openvswitch-xen.spec.in > openvswitch-xen.spec.tmp || exit 1; \
if cmp -s openvswitch-xen.spec.tmp xenserver/openvswitch-xen.spec; then touch xenserver/openvswitch-xen.spec; rm openvswitch-xen.spec.tmp; else mv openvswitch-xen.spec.tmp xenserver/openvswitch-xen.spec; fi
tests/system-traffic.at
make[2]: *** [check-tabs] Error 1
See above for files that use tabs for indentation.
Please use spaces instead.
Makefile:5786: recipe for target 'check-tabs' failed
make[2]: *** Waiting for unfinished jobs....
touch -c manpage-check
make[2]: Leaving directory '/home/runner/work/ovs/ovs'
make[1]: *** [all-recursive] Error 1
Makefile:5144: recipe for target 'all-recursive' failed
make[1]: Leaving directory '/home/runner/work/ovs/ovs'
Makefile:2835: recipe for target 'all' failed
make: *** [all] Error 2
##[error]Process completed with exit code 2.
####################################################################################
#### [End job log] "linux clang --disable-ssl" at step build
####################################################################################




####################################################################################
#### [Begin job log] "linux gcc afxdp 5.3" at step build
####################################################################################
	sed -n -e '/^$/q' -e 's/^/  /p';			   \
  sed -e '34,/%AUTHORS%/d' ./debian/copyright.in;	   \
} > debian/copyright
mv -f utilities/ovs-lib.tmp utilities/ovs-lib
(printf '\043 Generated automatically -- do not modify!    -*- buffer-read-only: t -*-\n' && sed -e 's,[@]VERSION[@],2.16.90,g') < ./rhel/openvswitch-dkms.spec.in > openvswitch-dkms.spec.tmp || exit 1; if cmp -s openvswitch-dkms.spec.tmp rhel/openvswitch-dkms.spec; then touch rhel/openvswitch-dkms.spec; rm openvswitch-dkms.spec.tmp; else mv openvswitch-dkms.spec.tmp rhel/openvswitch-dkms.spec; fi
(printf '\043 Generated automatically -- do not modify!    -*- buffer-read-only: t -*-\n' && sed -e 's,[@]VERSION[@],2.16.90,g') < ./rhel/kmod-openvswitch-rhel6.spec.in > kmod-openvswitch-rhel6.spec.tmp || exit 1; if cmp -s kmod-openvswitch-rhel6.spec.tmp rhel/kmod-openvswitch-rhel6.spec; then touch rhel/kmod-openvswitch-rhel6.spec; rm kmod-openvswitch-rhel6.spec.tmp; else mv kmod-openvswitch-rhel6.spec.tmp rhel/kmod-openvswitch-rhel6.spec; fi
(printf '\043 Generated automatically -- do not modify!    -*- buffer-read-only: t -*-\n' && sed -e 's,[@]VERSION[@],2.16.90,g') < ./rhel/openvswitch-kmod-fedora.spec.in > openvswitch-kmod-fedora.spec.tmp || exit 1; if cmp -s openvswitch-kmod-fedora.spec.tmp rhel/openvswitch-kmod-fedora.spec; then touch rhel/openvswitch-kmod-fedora.spec; rm openvswitch-kmod-fedora.spec.tmp; else mv openvswitch-kmod-fedora.spec.tmp rhel/openvswitch-kmod-fedora.spec; fi
(printf '\043 Generated automatically -- do not modify!    -*- buffer-read-only: t -*-\n' && sed -e 's,[@]VERSION[@],2.16.90,g') < ./rhel/openvswitch.spec.in > openvswitch.spec.tmp || exit 1; if cmp -s openvswitch.spec.tmp rhel/openvswitch.spec; then touch rhel/openvswitch.spec; rm openvswitch.spec.tmp; else mv openvswitch.spec.tmp rhel/openvswitch.spec; fi
(printf '\043 Generated automatically -- do not modify!    -*- buffer-read-only: t -*-\n' && sed -e 's,[@]VERSION[@],2.16.90,g') < ./rhel/openvswitch-fedora.spec.in > openvswitch-fedora.spec.tmp || exit 1; if cmp -s openvswitch-fedora.spec.tmp rhel/openvswitch-fedora.spec; then touch rhel/openvswitch-fedora.spec; rm openvswitch-fedora.spec.tmp; else mv openvswitch-fedora.spec.tmp rhel/openvswitch-fedora.spec; fi
(printf '\043 Generated automatically -- do not modify!    -*- buffer-read-only: t -*-\n' && sed -e 's,[@]VERSION[@],2.16.90,g') \
	< ./xenserver/openvswitch-xen.spec.in > openvswitch-xen.spec.tmp || exit 1; \
if cmp -s openvswitch-xen.spec.tmp xenserver/openvswitch-xen.spec; then touch xenserver/openvswitch-xen.spec; rm openvswitch-xen.spec.tmp; else mv openvswitch-xen.spec.tmp xenserver/openvswitch-xen.spec; fi
tests/system-traffic.at
See above for files that use tabs for indentation.
Please use spaces instead.
Makefile:5786: recipe for target 'check-tabs' failed
make[2]: *** [check-tabs] Error 1
make[2]: *** Waiting for unfinished jobs....
make[2]: Leaving directory '/home/runner/work/ovs/ovs'
Makefile:5144: recipe for target 'all-recursive' failed
make[1]: Leaving directory '/home/runner/work/ovs/ovs'
make[1]: *** [all-recursive] Error 1
make: *** [all] Error 2
Makefile:2835: recipe for target 'all' failed
##[error]Process completed with exit code 2.
####################################################################################
#### [End job log] "linux gcc afxdp 5.3" at step build
####################################################################################




####################################################################################
#### [Begin job log] "linux clang afxdp 5.3" at step build
####################################################################################
	sed -n -e '/^$/q' -e 's/^/  /p';			   \
  sed -e '34,/%AUTHORS%/d' ./debian/copyright.in;	   \
} > debian/copyright
sed: couldn't write 52 items to stdout: Broken pipe
(printf '\043 Generated automatically -- do not modify!    -*- buffer-read-only: t -*-\n' && sed -e 's,[@]VERSION[@],2.16.90,g') < ./rhel/openvswitch-dkms.spec.in > openvswitch-dkms.spec.tmp || exit 1; if cmp -s openvswitch-dkms.spec.tmp rhel/openvswitch-dkms.spec; then touch rhel/openvswitch-dkms.spec; rm openvswitch-dkms.spec.tmp; else mv openvswitch-dkms.spec.tmp rhel/openvswitch-dkms.spec; fi
(printf '\043 Generated automatically -- do not modify!    -*- buffer-read-only: t -*-\n' && sed -e 's,[@]VERSION[@],2.16.90,g') < ./rhel/kmod-openvswitch-rhel6.spec.in > kmod-openvswitch-rhel6.spec.tmp || exit 1; if cmp -s kmod-openvswitch-rhel6.spec.tmp rhel/kmod-openvswitch-rhel6.spec; then touch rhel/kmod-openvswitch-rhel6.spec; rm kmod-openvswitch-rhel6.spec.tmp; else mv kmod-openvswitch-rhel6.spec.tmp rhel/kmod-openvswitch-rhel6.spec; fi
(printf '\043 Generated automatically -- do not modify!    -*- buffer-read-only: t -*-\n' && sed -e 's,[@]VERSION[@],2.16.90,g') < ./rhel/openvswitch-kmod-fedora.spec.in > openvswitch-kmod-fedora.spec.tmp || exit 1; if cmp -s openvswitch-kmod-fedora.spec.tmp rhel/openvswitch-kmod-fedora.spec; then touch rhel/openvswitch-kmod-fedora.spec; rm openvswitch-kmod-fedora.spec.tmp; else mv openvswitch-kmod-fedora.spec.tmp rhel/openvswitch-kmod-fedora.spec; fi
(printf '\043 Generated automatically -- do not modify!    -*- buffer-read-only: t -*-\n' && sed -e 's,[@]VERSION[@],2.16.90,g') < ./rhel/openvswitch.spec.in > openvswitch.spec.tmp || exit 1; if cmp -s openvswitch.spec.tmp rhel/openvswitch.spec; then touch rhel/openvswitch.spec; rm openvswitch.spec.tmp; else mv openvswitch.spec.tmp rhel/openvswitch.spec; fi
(printf '\043 Generated automatically -- do not modify!    -*- buffer-read-only: t -*-\n' && sed -e 's,[@]VERSION[@],2.16.90,g') < ./rhel/openvswitch-fedora.spec.in > openvswitch-fedora.spec.tmp || exit 1; if cmp -s openvswitch-fedora.spec.tmp rhel/openvswitch-fedora.spec; then touch rhel/openvswitch-fedora.spec; rm openvswitch-fedora.spec.tmp; else mv openvswitch-fedora.spec.tmp rhel/openvswitch-fedora.spec; fi
(printf '\043 Generated automatically -- do not modify!    -*- buffer-read-only: t -*-\n' && sed -e 's,[@]VERSION[@],2.16.90,g') \
	< ./xenserver/openvswitch-xen.spec.in > openvswitch-xen.spec.tmp || exit 1; \
if cmp -s openvswitch-xen.spec.tmp xenserver/openvswitch-xen.spec; then touch xenserver/openvswitch-xen.spec; rm openvswitch-xen.spec.tmp; else mv openvswitch-xen.spec.tmp xenserver/openvswitch-xen.spec; fi
tests/system-traffic.at
make[2]: *** [check-tabs] Error 1
See above for files that use tabs for indentation.
make[2]: *** Waiting for unfinished jobs....
Please use spaces instead.
Makefile:5786: recipe for target 'check-tabs' failed
make[2]: Leaving directory '/home/runner/work/ovs/ovs'
make[1]: *** [all-recursive] Error 1
Makefile:5144: recipe for target 'all-recursive' failed
make[1]: Leaving directory '/home/runner/work/ovs/ovs'
make: *** [all] Error 2
Makefile:2835: recipe for target 'all' failed
##[error]Process completed with exit code 2.
####################################################################################
#### [End job log] "linux clang afxdp 5.3" at step build
####################################################################################




####################################################################################
#### [Begin job log] "linux gcc dpdk --enable-shared" at step build
####################################################################################
	sed -n -e '/^$/q' -e 's/^/  /p';			   \
  sed -e '34,/%AUTHORS%/d' ./debian/copyright.in;	   \
} > debian/copyright
(printf '\043 Generated automatically -- do not modify!    -*- buffer-read-only: t -*-\n' && sed -e 's,[@]VERSION[@],2.16.90,g') < ./rhel/openvswitch-dkms.spec.in > openvswitch-dkms.spec.tmp || exit 1; if cmp -s openvswitch-dkms.spec.tmp rhel/openvswitch-dkms.spec; then touch rhel/openvswitch-dkms.spec; rm openvswitch-dkms.spec.tmp; else mv openvswitch-dkms.spec.tmp rhel/openvswitch-dkms.spec; fi
mv -f utilities/ovs-lib.tmp utilities/ovs-lib
(printf '\043 Generated automatically -- do not modify!    -*- buffer-read-only: t -*-\n' && sed -e 's,[@]VERSION[@],2.16.90,g') < ./rhel/kmod-openvswitch-rhel6.spec.in > kmod-openvswitch-rhel6.spec.tmp || exit 1; if cmp -s kmod-openvswitch-rhel6.spec.tmp rhel/kmod-openvswitch-rhel6.spec; then touch rhel/kmod-openvswitch-rhel6.spec; rm kmod-openvswitch-rhel6.spec.tmp; else mv kmod-openvswitch-rhel6.spec.tmp rhel/kmod-openvswitch-rhel6.spec; fi
(printf '\043 Generated automatically -- do not modify!    -*- buffer-read-only: t -*-\n' && sed -e 's,[@]VERSION[@],2.16.90,g') < ./rhel/openvswitch-kmod-fedora.spec.in > openvswitch-kmod-fedora.spec.tmp || exit 1; if cmp -s openvswitch-kmod-fedora.spec.tmp rhel/openvswitch-kmod-fedora.spec; then touch rhel/openvswitch-kmod-fedora.spec; rm openvswitch-kmod-fedora.spec.tmp; else mv openvswitch-kmod-fedora.spec.tmp rhel/openvswitch-kmod-fedora.spec; fi
(printf '\043 Generated automatically -- do not modify!    -*- buffer-read-only: t -*-\n' && sed -e 's,[@]VERSION[@],2.16.90,g') < ./rhel/openvswitch.spec.in > openvswitch.spec.tmp || exit 1; if cmp -s openvswitch.spec.tmp rhel/openvswitch.spec; then touch rhel/openvswitch.spec; rm openvswitch.spec.tmp; else mv openvswitch.spec.tmp rhel/openvswitch.spec; fi
(printf '\043 Generated automatically -- do not modify!    -*- buffer-read-only: t -*-\n' && sed -e 's,[@]VERSION[@],2.16.90,g') < ./rhel/openvswitch-fedora.spec.in > openvswitch-fedora.spec.tmp || exit 1; if cmp -s openvswitch-fedora.spec.tmp rhel/openvswitch-fedora.spec; then touch rhel/openvswitch-fedora.spec; rm openvswitch-fedora.spec.tmp; else mv openvswitch-fedora.spec.tmp rhel/openvswitch-fedora.spec; fi
(printf '\043 Generated automatically -- do not modify!    -*- buffer-read-only: t -*-\n' && sed -e 's,[@]VERSION[@],2.16.90,g') \
	< ./xenserver/openvswitch-xen.spec.in > openvswitch-xen.spec.tmp || exit 1; \
if cmp -s openvswitch-xen.spec.tmp xenserver/openvswitch-xen.spec; then touch xenserver/openvswitch-xen.spec; rm openvswitch-xen.spec.tmp; else mv openvswitch-xen.spec.tmp xenserver/openvswitch-xen.spec; fi
tests/system-traffic.at
make[2]: *** [check-tabs] Error 1
See above for files that use tabs for indentation.
make[2]: *** Waiting for unfinished jobs....
Please use spaces instead.
Makefile:5786: recipe for target 'check-tabs' failed
make[2]: Leaving directory '/home/runner/work/ovs/ovs'
Makefile:5144: recipe for target 'all-recursive' failed
make[1]: Leaving directory '/home/runner/work/ovs/ovs'
make[1]: *** [all-recursive] Error 1
Makefile:2835: recipe for target 'all' failed
make: *** [all] Error 2
##[error]Process completed with exit code 2.
####################################################################################
#### [End job log] "linux gcc dpdk --enable-shared" at step build
####################################################################################




####################################################################################
#### [Begin job log] "linux clang dpdk --enable-shared" at step build
####################################################################################
  sed -e '34,/%AUTHORS%/d' ./debian/copyright.in;	   \
} > debian/copyright
(printf '\043 Generated automatically -- do not modify!    -*- buffer-read-only: t -*-\n' && sed -e 's,[@]VERSION[@],2.16.90,g') < ./rhel/openvswitch-dkms.spec.in > openvswitch-dkms.spec.tmp || exit 1; if cmp -s openvswitch-dkms.spec.tmp rhel/openvswitch-dkms.spec; then touch rhel/openvswitch-dkms.spec; rm openvswitch-dkms.spec.tmp; else mv openvswitch-dkms.spec.tmp rhel/openvswitch-dkms.spec; fi
mv -f utilities/ovs-lib.tmp utilities/ovs-lib
(printf '\043 Generated automatically -- do not modify!    -*- buffer-read-only: t -*-\n' && sed -e 's,[@]VERSION[@],2.16.90,g') < ./rhel/kmod-openvswitch-rhel6.spec.in > kmod-openvswitch-rhel6.spec.tmp || exit 1; if cmp -s kmod-openvswitch-rhel6.spec.tmp rhel/kmod-openvswitch-rhel6.spec; then touch rhel/kmod-openvswitch-rhel6.spec; rm kmod-openvswitch-rhel6.spec.tmp; else mv kmod-openvswitch-rhel6.spec.tmp rhel/kmod-openvswitch-rhel6.spec; fi
(printf '\043 Generated automatically -- do not modify!    -*- buffer-read-only: t -*-\n' && sed -e 's,[@]VERSION[@],2.16.90,g') < ./rhel/openvswitch-kmod-fedora.spec.in > openvswitch-kmod-fedora.spec.tmp || exit 1; if cmp -s openvswitch-kmod-fedora.spec.tmp rhel/openvswitch-kmod-fedora.spec; then touch rhel/openvswitch-kmod-fedora.spec; rm openvswitch-kmod-fedora.spec.tmp; else mv openvswitch-kmod-fedora.spec.tmp rhel/openvswitch-kmod-fedora.spec; fi
(printf '\043 Generated automatically -- do not modify!    -*- buffer-read-only: t -*-\n' && sed -e 's,[@]VERSION[@],2.16.90,g') < ./rhel/openvswitch.spec.in > openvswitch.spec.tmp || exit 1; if cmp -s openvswitch.spec.tmp rhel/openvswitch.spec; then touch rhel/openvswitch.spec; rm openvswitch.spec.tmp; else mv openvswitch.spec.tmp rhel/openvswitch.spec; fi
(printf '\043 Generated automatically -- do not modify!    -*- buffer-read-only: t -*-\n' && sed -e 's,[@]VERSION[@],2.16.90,g') < ./rhel/openvswitch-fedora.spec.in > openvswitch-fedora.spec.tmp || exit 1; if cmp -s openvswitch-fedora.spec.tmp rhel/openvswitch-fedora.spec; then touch rhel/openvswitch-fedora.spec; rm openvswitch-fedora.spec.tmp; else mv openvswitch-fedora.spec.tmp rhel/openvswitch-fedora.spec; fi
(printf '\043 Generated automatically -- do not modify!    -*- buffer-read-only: t -*-\n' && sed -e 's,[@]VERSION[@],2.16.90,g') \
	< ./xenserver/openvswitch-xen.spec.in > openvswitch-xen.spec.tmp || exit 1; \
if cmp -s openvswitch-xen.spec.tmp xenserver/openvswitch-xen.spec; then touch xenserver/openvswitch-xen.spec; rm openvswitch-xen.spec.tmp; else mv openvswitch-xen.spec.tmp xenserver/openvswitch-xen.spec; fi
tests/system-traffic.at
See above for files that use tabs for indentation.
Please use spaces instead.
make[2]: *** [check-tabs] Error 1
make[2]: *** Waiting for unfinished jobs....
Makefile:5786: recipe for target 'check-tabs' failed
libtool: compile:  clang -DHAVE_CONFIG_H -I. -I ./include -I ./include -I ./lib -I ./lib -Wstrict-prototypes -Wall -Wextra -Wno-sign-compare -Wpointer-arith -Wformat -Wformat-security -Wswitch-enum -Wunused-parameter -Wbad-function-cast -Wcast-align -Wstrict-prototypes -Wold-style-definition -Wmissing-prototypes -Wmissing-field-initializers -Wthread-safety -fno-strict-aliasing -Wswitch-bool -Wlogical-not-parentheses -Wsizeof-array-argument -Wshift-negative-value -Qunused-arguments -Wshadow -Wno-null-pointer-arithmetic -Warray-bounds-pointer-arithmetic -mssse3 -include rte_config.h -I/home/runner/work/ovs/ovs/dpdk-dir/build/include -Werror -Werror -D_FILE_OFFSET_BITS=64 -g -O2 -Wno-cast-align -Wno-error=unused-command-line-argument -MT lib/vswitch-idl.lo -MD -MP -MF lib/.deps/vswitch-idl.Tpo -c lib/vswitch-idl.c -o lib/vswitch-idl.o >/dev/null 2>&1
make[2]: Leaving directory '/home/runner/work/ovs/ovs'
make[1]: *** [all-recursive] Error 1
Makefile:5144: recipe for target 'all-recursive' failed
make[1]: Leaving directory '/home/runner/work/ovs/ovs'
Makefile:2835: recipe for target 'all' failed
make: *** [all] Error 2
##[error]Process completed with exit code 2.
####################################################################################
#### [End job log] "linux clang dpdk --enable-shared" at step build
####################################################################################




####################################################################################
#### [Begin job log] "linux gcc dpdk-shared" at step build
####################################################################################
	sed -n -e '/^$/q' -e 's/^/  /p';			   \
  sed -e '34,/%AUTHORS%/d' ./debian/copyright.in;	   \
} > debian/copyright
(printf '\043 Generated automatically -- do not modify!    -*- buffer-read-only: t -*-\n' && sed -e 's,[@]VERSION[@],2.16.90,g') < ./rhel/openvswitch-dkms.spec.in > openvswitch-dkms.spec.tmp || exit 1; if cmp -s openvswitch-dkms.spec.tmp rhel/openvswitch-dkms.spec; then touch rhel/openvswitch-dkms.spec; rm openvswitch-dkms.spec.tmp; else mv openvswitch-dkms.spec.tmp rhel/openvswitch-dkms.spec; fi
mv -f utilities/ovs-lib.tmp utilities/ovs-lib
(printf '\043 Generated automatically -- do not modify!    -*- buffer-read-only: t -*-\n' && sed -e 's,[@]VERSION[@],2.16.90,g') < ./rhel/kmod-openvswitch-rhel6.spec.in > kmod-openvswitch-rhel6.spec.tmp || exit 1; if cmp -s kmod-openvswitch-rhel6.spec.tmp rhel/kmod-openvswitch-rhel6.spec; then touch rhel/kmod-openvswitch-rhel6.spec; rm kmod-openvswitch-rhel6.spec.tmp; else mv kmod-openvswitch-rhel6.spec.tmp rhel/kmod-openvswitch-rhel6.spec; fi
(printf '\043 Generated automatically -- do not modify!    -*- buffer-read-only: t -*-\n' && sed -e 's,[@]VERSION[@],2.16.90,g') < ./rhel/openvswitch-kmod-fedora.spec.in > openvswitch-kmod-fedora.spec.tmp || exit 1; if cmp -s openvswitch-kmod-fedora.spec.tmp rhel/openvswitch-kmod-fedora.spec; then touch rhel/openvswitch-kmod-fedora.spec; rm openvswitch-kmod-fedora.spec.tmp; else mv openvswitch-kmod-fedora.spec.tmp rhel/openvswitch-kmod-fedora.spec; fi
(printf '\043 Generated automatically -- do not modify!    -*- buffer-read-only: t -*-\n' && sed -e 's,[@]VERSION[@],2.16.90,g') < ./rhel/openvswitch.spec.in > openvswitch.spec.tmp || exit 1; if cmp -s openvswitch.spec.tmp rhel/openvswitch.spec; then touch rhel/openvswitch.spec; rm openvswitch.spec.tmp; else mv openvswitch.spec.tmp rhel/openvswitch.spec; fi
(printf '\043 Generated automatically -- do not modify!    -*- buffer-read-only: t -*-\n' && sed -e 's,[@]VERSION[@],2.16.90,g') < ./rhel/openvswitch-fedora.spec.in > openvswitch-fedora.spec.tmp || exit 1; if cmp -s openvswitch-fedora.spec.tmp rhel/openvswitch-fedora.spec; then touch rhel/openvswitch-fedora.spec; rm openvswitch-fedora.spec.tmp; else mv openvswitch-fedora.spec.tmp rhel/openvswitch-fedora.spec; fi
(printf '\043 Generated automatically -- do not modify!    -*- buffer-read-only: t -*-\n' && sed -e 's,[@]VERSION[@],2.16.90,g') \
	< ./xenserver/openvswitch-xen.spec.in > openvswitch-xen.spec.tmp || exit 1; \
if cmp -s openvswitch-xen.spec.tmp xenserver/openvswitch-xen.spec; then touch xenserver/openvswitch-xen.spec; rm openvswitch-xen.spec.tmp; else mv openvswitch-xen.spec.tmp xenserver/openvswitch-xen.spec; fi
tests/system-traffic.at
make[2]: *** [check-tabs] Error 1
make[2]: *** Waiting for unfinished jobs....
See above for files that use tabs for indentation.
Please use spaces instead.
Makefile:5786: recipe for target 'check-tabs' failed
make[2]: Leaving directory '/home/runner/work/ovs/ovs'
Makefile:5144: recipe for target 'all-recursive' failed
make[1]: Leaving directory '/home/runner/work/ovs/ovs'
make[1]: *** [all-recursive] Error 1
Makefile:2835: recipe for target 'all' failed
make: *** [all] Error 2
##[error]Process completed with exit code 2.
####################################################################################
#### [End job log] "linux gcc dpdk-shared" at step build
####################################################################################




####################################################################################
#### [Begin job log] "linux clang dpdk-shared" at step build
####################################################################################
	sed -n -e '/^$/q' -e 's/^/  /p';			   \
  sed -e '34,/%AUTHORS%/d' ./debian/copyright.in;	   \
} > debian/copyright
(printf '\043 Generated automatically -- do not modify!    -*- buffer-read-only: t -*-\n' && sed -e 's,[@]VERSION[@],2.16.90,g') < ./rhel/openvswitch-dkms.spec.in > openvswitch-dkms.spec.tmp || exit 1; if cmp -s openvswitch-dkms.spec.tmp rhel/openvswitch-dkms.spec; then touch rhel/openvswitch-dkms.spec; rm openvswitch-dkms.spec.tmp; else mv openvswitch-dkms.spec.tmp rhel/openvswitch-dkms.spec; fi
mv -f utilities/ovs-lib.tmp utilities/ovs-lib
(printf '\043 Generated automatically -- do not modify!    -*- buffer-read-only: t -*-\n' && sed -e 's,[@]VERSION[@],2.16.90,g') < ./rhel/kmod-openvswitch-rhel6.spec.in > kmod-openvswitch-rhel6.spec.tmp || exit 1; if cmp -s kmod-openvswitch-rhel6.spec.tmp rhel/kmod-openvswitch-rhel6.spec; then touch rhel/kmod-openvswitch-rhel6.spec; rm kmod-openvswitch-rhel6.spec.tmp; else mv kmod-openvswitch-rhel6.spec.tmp rhel/kmod-openvswitch-rhel6.spec; fi
(printf '\043 Generated automatically -- do not modify!    -*- buffer-read-only: t -*-\n' && sed -e 's,[@]VERSION[@],2.16.90,g') < ./rhel/openvswitch-kmod-fedora.spec.in > openvswitch-kmod-fedora.spec.tmp || exit 1; if cmp -s openvswitch-kmod-fedora.spec.tmp rhel/openvswitch-kmod-fedora.spec; then touch rhel/openvswitch-kmod-fedora.spec; rm openvswitch-kmod-fedora.spec.tmp; else mv openvswitch-kmod-fedora.spec.tmp rhel/openvswitch-kmod-fedora.spec; fi
(printf '\043 Generated automatically -- do not modify!    -*- buffer-read-only: t -*-\n' && sed -e 's,[@]VERSION[@],2.16.90,g') < ./rhel/openvswitch.spec.in > openvswitch.spec.tmp || exit 1; if cmp -s openvswitch.spec.tmp rhel/openvswitch.spec; then touch rhel/openvswitch.spec; rm openvswitch.spec.tmp; else mv openvswitch.spec.tmp rhel/openvswitch.spec; fi
(printf '\043 Generated automatically -- do not modify!    -*- buffer-read-only: t -*-\n' && sed -e 's,[@]VERSION[@],2.16.90,g') < ./rhel/openvswitch-fedora.spec.in > openvswitch-fedora.spec.tmp || exit 1; if cmp -s openvswitch-fedora.spec.tmp rhel/openvswitch-fedora.spec; then touch rhel/openvswitch-fedora.spec; rm openvswitch-fedora.spec.tmp; else mv openvswitch-fedora.spec.tmp rhel/openvswitch-fedora.spec; fi
(printf '\043 Generated automatically -- do not modify!    -*- buffer-read-only: t -*-\n' && sed -e 's,[@]VERSION[@],2.16.90,g') \
	< ./xenserver/openvswitch-xen.spec.in > openvswitch-xen.spec.tmp || exit 1; \
if cmp -s openvswitch-xen.spec.tmp xenserver/openvswitch-xen.spec; then touch xenserver/openvswitch-xen.spec; rm openvswitch-xen.spec.tmp; else mv openvswitch-xen.spec.tmp xenserver/openvswitch-xen.spec; fi
tests/system-traffic.at
See above for files that use tabs for indentation.
Please use spaces instead.
Makefile:5786: recipe for target 'check-tabs' failed
make[2]: *** [check-tabs] Error 1
make[2]: *** Waiting for unfinished jobs....
make[2]: Leaving directory '/home/runner/work/ovs/ovs'
Makefile:5144: recipe for target 'all-recursive' failed
make[1]: *** [all-recursive] Error 1
make[1]: Leaving directory '/home/runner/work/ovs/ovs'
make: *** [all] Error 2
Makefile:2835: recipe for target 'all' failed
##[error]Process completed with exit code 2.
####################################################################################
#### [End job log] "linux clang dpdk-shared" at step build
####################################################################################




####################################################################################
#### [Begin job log] "linux gcc dpdk-shared --enable-shared" at step build
####################################################################################
	sed -n -e '/^$/q' -e 's/^/  /p';			   \
  sed -e '34,/%AUTHORS%/d' ./debian/copyright.in;	   \
} > debian/copyright
(printf '\043 Generated automatically -- do not modify!    -*- buffer-read-only: t -*-\n' && sed -e 's,[@]VERSION[@],2.16.90,g') < ./rhel/openvswitch-dkms.spec.in > openvswitch-dkms.spec.tmp || exit 1; if cmp -s openvswitch-dkms.spec.tmp rhel/openvswitch-dkms.spec; then touch rhel/openvswitch-dkms.spec; rm openvswitch-dkms.spec.tmp; else mv openvswitch-dkms.spec.tmp rhel/openvswitch-dkms.spec; fi
(printf '\043 Generated automatically -- do not modify!    -*- buffer-read-only: t -*-\n' && sed -e 's,[@]VERSION[@],2.16.90,g') < ./rhel/kmod-openvswitch-rhel6.spec.in > kmod-openvswitch-rhel6.spec.tmp || exit 1; if cmp -s kmod-openvswitch-rhel6.spec.tmp rhel/kmod-openvswitch-rhel6.spec; then touch rhel/kmod-openvswitch-rhel6.spec; rm kmod-openvswitch-rhel6.spec.tmp; else mv kmod-openvswitch-rhel6.spec.tmp rhel/kmod-openvswitch-rhel6.spec; fi
mv -f utilities/ovs-lib.tmp utilities/ovs-lib
(printf '\043 Generated automatically -- do not modify!    -*- buffer-read-only: t -*-\n' && sed -e 's,[@]VERSION[@],2.16.90,g') < ./rhel/openvswitch-kmod-fedora.spec.in > openvswitch-kmod-fedora.spec.tmp || exit 1; if cmp -s openvswitch-kmod-fedora.spec.tmp rhel/openvswitch-kmod-fedora.spec; then touch rhel/openvswitch-kmod-fedora.spec; rm openvswitch-kmod-fedora.spec.tmp; else mv openvswitch-kmod-fedora.spec.tmp rhel/openvswitch-kmod-fedora.spec; fi
(printf '\043 Generated automatically -- do not modify!    -*- buffer-read-only: t -*-\n' && sed -e 's,[@]VERSION[@],2.16.90,g') < ./rhel/openvswitch.spec.in > openvswitch.spec.tmp || exit 1; if cmp -s openvswitch.spec.tmp rhel/openvswitch.spec; then touch rhel/openvswitch.spec; rm openvswitch.spec.tmp; else mv openvswitch.spec.tmp rhel/openvswitch.spec; fi
(printf '\043 Generated automatically -- do not modify!    -*- buffer-read-only: t -*-\n' && sed -e 's,[@]VERSION[@],2.16.90,g') < ./rhel/openvswitch-fedora.spec.in > openvswitch-fedora.spec.tmp || exit 1; if cmp -s openvswitch-fedora.spec.tmp rhel/openvswitch-fedora.spec; then touch rhel/openvswitch-fedora.spec; rm openvswitch-fedora.spec.tmp; else mv openvswitch-fedora.spec.tmp rhel/openvswitch-fedora.spec; fi
(printf '\043 Generated automatically -- do not modify!    -*- buffer-read-only: t -*-\n' && sed -e 's,[@]VERSION[@],2.16.90,g') \
	< ./xenserver/openvswitch-xen.spec.in > openvswitch-xen.spec.tmp || exit 1; \
if cmp -s openvswitch-xen.spec.tmp xenserver/openvswitch-xen.spec; then touch xenserver/openvswitch-xen.spec; rm openvswitch-xen.spec.tmp; else mv openvswitch-xen.spec.tmp xenserver/openvswitch-xen.spec; fi
tests/system-traffic.at
make[2]: *** [check-tabs] Error 1
See above for files that use tabs for indentation.
make[2]: *** Waiting for unfinished jobs....
Please use spaces instead.
Makefile:5786: recipe for target 'check-tabs' failed
make[2]: Leaving directory '/home/runner/work/ovs/ovs'
Makefile:5144: recipe for target 'all-recursive' failed
make[1]: Leaving directory '/home/runner/work/ovs/ovs'
make[1]: *** [all-recursive] Error 1
Makefile:2835: recipe for target 'all' failed
make: *** [all] Error 2
##[error]Process completed with exit code 2.
####################################################################################
#### [End job log] "linux gcc dpdk-shared --enable-shared" at step build
####################################################################################




####################################################################################
#### [Begin job log] "linux clang dpdk-shared --enable-shared" at step build
####################################################################################
  sed -e '34,/%AUTHORS%/d' ./debian/copyright.in;	   \
} > debian/copyright
(printf '\043 Generated automatically -- do not modify!    -*- buffer-read-only: t -*-\n' && sed -e 's,[@]VERSION[@],2.16.90,g') < ./rhel/openvswitch-dkms.spec.in > openvswitch-dkms.spec.tmp || exit 1; if cmp -s openvswitch-dkms.spec.tmp rhel/openvswitch-dkms.spec; then touch rhel/openvswitch-dkms.spec; rm openvswitch-dkms.spec.tmp; else mv openvswitch-dkms.spec.tmp rhel/openvswitch-dkms.spec; fi
mv -f utilities/ovs-lib.tmp utilities/ovs-lib
(printf '\043 Generated automatically -- do not modify!    -*- buffer-read-only: t -*-\n' && sed -e 's,[@]VERSION[@],2.16.90,g') < ./rhel/kmod-openvswitch-rhel6.spec.in > kmod-openvswitch-rhel6.spec.tmp || exit 1; if cmp -s kmod-openvswitch-rhel6.spec.tmp rhel/kmod-openvswitch-rhel6.spec; then touch rhel/kmod-openvswitch-rhel6.spec; rm kmod-openvswitch-rhel6.spec.tmp; else mv kmod-openvswitch-rhel6.spec.tmp rhel/kmod-openvswitch-rhel6.spec; fi
(printf '\043 Generated automatically -- do not modify!    -*- buffer-read-only: t -*-\n' && sed -e 's,[@]VERSION[@],2.16.90,g') < ./rhel/openvswitch-kmod-fedora.spec.in > openvswitch-kmod-fedora.spec.tmp || exit 1; if cmp -s openvswitch-kmod-fedora.spec.tmp rhel/openvswitch-kmod-fedora.spec; then touch rhel/openvswitch-kmod-fedora.spec; rm openvswitch-kmod-fedora.spec.tmp; else mv openvswitch-kmod-fedora.spec.tmp rhel/openvswitch-kmod-fedora.spec; fi
(printf '\043 Generated automatically -- do not modify!    -*- buffer-read-only: t -*-\n' && sed -e 's,[@]VERSION[@],2.16.90,g') < ./rhel/openvswitch.spec.in > openvswitch.spec.tmp || exit 1; if cmp -s openvswitch.spec.tmp rhel/openvswitch.spec; then touch rhel/openvswitch.spec; rm openvswitch.spec.tmp; else mv openvswitch.spec.tmp rhel/openvswitch.spec; fi
(printf '\043 Generated automatically -- do not modify!    -*- buffer-read-only: t -*-\n' && sed -e 's,[@]VERSION[@],2.16.90,g') < ./rhel/openvswitch-fedora.spec.in > openvswitch-fedora.spec.tmp || exit 1; if cmp -s openvswitch-fedora.spec.tmp rhel/openvswitch-fedora.spec; then touch rhel/openvswitch-fedora.spec; rm openvswitch-fedora.spec.tmp; else mv openvswitch-fedora.spec.tmp rhel/openvswitch-fedora.spec; fi
(printf '\043 Generated automatically -- do not modify!    -*- buffer-read-only: t -*-\n' && sed -e 's,[@]VERSION[@],2.16.90,g') \
	< ./xenserver/openvswitch-xen.spec.in > openvswitch-xen.spec.tmp || exit 1; \
if cmp -s openvswitch-xen.spec.tmp xenserver/openvswitch-xen.spec; then touch xenserver/openvswitch-xen.spec; rm openvswitch-xen.spec.tmp; else mv openvswitch-xen.spec.tmp xenserver/openvswitch-xen.spec; fi
tests/system-traffic.at
See above for files that use tabs for indentation.
Please use spaces instead.
make[2]: *** [check-tabs] Error 1
Makefile:5786: recipe for target 'check-tabs' failed
make[2]: *** Waiting for unfinished jobs....
libtool: compile:  clang -DHAVE_CONFIG_H -I. -I ./include -I ./include -I ./lib -I ./lib -Wstrict-prototypes -Wall -Wextra -Wno-sign-compare -Wpointer-arith -Wformat -Wformat-security -Wswitch-enum -Wunused-parameter -Wbad-function-cast -Wcast-align -Wstrict-prototypes -Wold-style-definition -Wmissing-prototypes -Wmissing-field-initializers -Wthread-safety -fno-strict-aliasing -Wswitch-bool -Wlogical-not-parentheses -Wsizeof-array-argument -Wshift-negative-value -Qunused-arguments -Wshadow -Wno-null-pointer-arithmetic -Warray-bounds-pointer-arithmetic -mssse3 -include rte_config.h -I/home/runner/work/ovs/ovs/dpdk-dir/build/include -Werror -Werror -D_FILE_OFFSET_BITS=64 -g -O2 -Wno-cast-align -Wno-error=unused-command-line-argument -MT lib/vswitch-idl.lo -MD -MP -MF lib/.deps/vswitch-idl.Tpo -c lib/vswitch-idl.c -o lib/vswitch-idl.o >/dev/null 2>&1
make[2]: Leaving directory '/home/runner/work/ovs/ovs'
Makefile:5144: recipe for target 'all-recursive' failed
make[1]: Leaving directory '/home/runner/work/ovs/ovs'
Makefile:2835: recipe for target 'all' failed
make[1]: *** [all-recursive] Error 1
make: *** [all] Error 2
##[error]Process completed with exit code 2.
####################################################################################
#### [End job log] "linux clang dpdk-shared --enable-shared" at step build
####################################################################################




####################################################################################
#### [Begin job log] "linux gcc m32 --disable-ssl" at step build
####################################################################################
	sed -n -e '/^$/q' -e 's/^/  /p';			   \
  sed -e '34,/%AUTHORS%/d' ./debian/copyright.in;	   \
} > debian/copyright
(printf '\043 Generated automatically -- do not modify!    -*- buffer-read-only: t -*-\n' && sed -e 's,[@]VERSION[@],2.16.90,g') < ./rhel/openvswitch-dkms.spec.in > openvswitch-dkms.spec.tmp || exit 1; if cmp -s openvswitch-dkms.spec.tmp rhel/openvswitch-dkms.spec; then touch rhel/openvswitch-dkms.spec; rm openvswitch-dkms.spec.tmp; else mv openvswitch-dkms.spec.tmp rhel/openvswitch-dkms.spec; fi
mv -f utilities/ovs-lib.tmp utilities/ovs-lib
(printf '\043 Generated automatically -- do not modify!    -*- buffer-read-only: t -*-\n' && sed -e 's,[@]VERSION[@],2.16.90,g') < ./rhel/kmod-openvswitch-rhel6.spec.in > kmod-openvswitch-rhel6.spec.tmp || exit 1; if cmp -s kmod-openvswitch-rhel6.spec.tmp rhel/kmod-openvswitch-rhel6.spec; then touch rhel/kmod-openvswitch-rhel6.spec; rm kmod-openvswitch-rhel6.spec.tmp; else mv kmod-openvswitch-rhel6.spec.tmp rhel/kmod-openvswitch-rhel6.spec; fi
(printf '\043 Generated automatically -- do not modify!    -*- buffer-read-only: t -*-\n' && sed -e 's,[@]VERSION[@],2.16.90,g') < ./rhel/openvswitch-kmod-fedora.spec.in > openvswitch-kmod-fedora.spec.tmp || exit 1; if cmp -s openvswitch-kmod-fedora.spec.tmp rhel/openvswitch-kmod-fedora.spec; then touch rhel/openvswitch-kmod-fedora.spec; rm openvswitch-kmod-fedora.spec.tmp; else mv openvswitch-kmod-fedora.spec.tmp rhel/openvswitch-kmod-fedora.spec; fi
(printf '\043 Generated automatically -- do not modify!    -*- buffer-read-only: t -*-\n' && sed -e 's,[@]VERSION[@],2.16.90,g') < ./rhel/openvswitch.spec.in > openvswitch.spec.tmp || exit 1; if cmp -s openvswitch.spec.tmp rhel/openvswitch.spec; then touch rhel/openvswitch.spec; rm openvswitch.spec.tmp; else mv openvswitch.spec.tmp rhel/openvswitch.spec; fi
(printf '\043 Generated automatically -- do not modify!    -*- buffer-read-only: t -*-\n' && sed -e 's,[@]VERSION[@],2.16.90,g') < ./rhel/openvswitch-fedora.spec.in > openvswitch-fedora.spec.tmp || exit 1; if cmp -s openvswitch-fedora.spec.tmp rhel/openvswitch-fedora.spec; then touch rhel/openvswitch-fedora.spec; rm openvswitch-fedora.spec.tmp; else mv openvswitch-fedora.spec.tmp rhel/openvswitch-fedora.spec; fi
(printf '\043 Generated automatically -- do not modify!    -*- buffer-read-only: t -*-\n' && sed -e 's,[@]VERSION[@],2.16.90,g') \
	< ./xenserver/openvswitch-xen.spec.in > openvswitch-xen.spec.tmp || exit 1; \
if cmp -s openvswitch-xen.spec.tmp xenserver/openvswitch-xen.spec; then touch xenserver/openvswitch-xen.spec; rm openvswitch-xen.spec.tmp; else mv openvswitch-xen.spec.tmp xenserver/openvswitch-xen.spec; fi
tests/system-traffic.at
make[2]: *** [check-tabs] Error 1
See above for files that use tabs for indentation.
Please use spaces instead.
Makefile:5786: recipe for target 'check-tabs' failed
make[2]: *** Waiting for unfinished jobs....
make[2]: Leaving directory '/home/runner/work/ovs/ovs'
Makefile:5144: recipe for target 'all-recursive' failed
make[1]: Leaving directory '/home/runner/work/ovs/ovs'
make[1]: *** [all-recursive] Error 1
Makefile:2835: recipe for target 'all' failed
make: *** [all] Error 2
##[error]Process completed with exit code 2.
####################################################################################
#### [End job log] "linux gcc m32 --disable-ssl" at step build
####################################################################################




####################################################################################
#### [Begin job log] "linux gcc deb" at step build
####################################################################################
    -e 's,[@]sysconfdir[@],/etc,g' \
    -e 's,[@]bindir[@],/usr/bin,g' \
    -e 's,[@]sbindir[@],/usr/sbin,g' \
    -e 's,[@]abs_builddir[@],/home/runner/work/ovs/ovs,g' \
    -e 's,[@]abs_top_srcdir[@],/home/runner/work/ovs/ovs,g' \
  > utilities/ovs-lib.tmp
mv -f utilities/ovs-lib.tmp utilities/ovs-lib
make[4]: Entering directory '/home/runner/work/ovs/ovs/datapath'
make[4]: Leaving directory '/home/runner/work/ovs/ovs/datapath'
tests/system-traffic.at
See above for files that use tabs for indentation.
Please use spaces instead.
Makefile:5786: recipe for target 'check-tabs' failed
make[3]: *** [check-tabs] Error 1
make[2]: *** [install-recursive] Error 1
make[1]: *** [install] Error 2
dh_auto_install: make -j1 install DESTDIR=/home/runner/work/ovs/ovs/debian/tmp AM_UPDATE_INFO_DIR=no returned exit code 2
make[3]: Leaving directory '/home/runner/work/ovs/ovs'
Makefile:5144: recipe for target 'install-recursive' failed
make[2]: Leaving directory '/home/runner/work/ovs/ovs'
Makefile:5449: recipe for target 'install' failed
make[1]: Leaving directory '/home/runner/work/ovs/ovs'
debian/rules:25: recipe for target 'binary' failed
make: *** [binary] Error 2
##[error]Process completed with exit code 2.
####################################################################################
#### [End job log] "linux gcc deb" at step build
####################################################################################
--------------------------------END LOGS-----------------------------



More information about the build mailing list