[ovs-build] |fail| pw1558021 [ovs-dev] [PATCH v1 04/18] build-aux: split extract-ofp-fields

0-day Robot robot at bytheb.org
Mon Nov 22 12:18:38 UTC 2021


From: robot at bytheb.org

Test-Label: github-robot: Build and Test
Test-Status: fail
http://patchwork.ozlabs.org/api/patches/1558021/

_github build: failed_
Build URL: https://github.com/ovsrobot/ovs/actions/runs/1489997078
Build Logs:
-----------------------Summary of failed steps-----------------------
"linux gcc --disable-ssl" failed at step build
"linux clang --disable-ssl" failed at step build
"linux gcc test 3.16" failed at step build
"linux clang test 3.16 asan" failed at step build
"linux gcc test --enable-shared" failed at step build
"linux clang test --enable-shared" failed at step build
"linux gcc test dpdk" failed at step build
"linux clang test dpdk" failed at step build
"linux gcc test -ljemalloc" failed at step build
"linux clang test -ljemalloc" failed at step build
"linux gcc afxdp 5.3" failed at step build
"linux clang afxdp 5.3" failed at step build
"linux gcc dpdk --enable-shared" failed at step build
"linux clang dpdk --enable-shared" failed at step build
"linux gcc dpdk-shared" failed at step build
"linux clang dpdk-shared" failed at step build
"linux gcc dpdk-shared --enable-shared" failed at step build
"linux clang dpdk-shared --enable-shared" failed at step build
"linux gcc m32 --disable-ssl" failed at step build
----------------------End summary of failed steps--------------------

-------------------------------BEGIN LOGS----------------------------
####################################################################################
#### [Begin job log] "linux gcc --disable-ssl" at step build
####################################################################################
dumping search index in English (code: en)... done
dumping object inventory... done
build succeeded.

The HTML pages are in Documentation/_build/html.
sphinx-build  -b man -W -n -d ./Documentation/_build/doctrees  ./Documentation ./Documentation/_build/man && touch docs-check
Running Sphinx v4.3.0
Cannot find 'ovs-sphinx-theme' package. Falling back to default theme.
making output directory... done
loading pickled environment... done
building [mo]: targets for 0 po files that are out of date
building [man]: all manpages
updating environment: 0 added, 0 changed, 0 removed
looking for now-outdated files... none found
writing... ovs-actions.7 { } ovs-appctl.8 { } ovs-ctl.8 { } ovs-l3ping.8 { } ovs-parse-backtrace.8 { } ovs-pki.8 { } ovs-sim.1 { } ovs-tcpdump.8 { } ovs-tcpundump.1 { } ovs-test.8 { } ovs-vlan-test.8 { } ovsdb-server.7 { } ovsdb.5 { } ovsdb.7 { } done
build succeeded.

The manual pages are in Documentation/_build/man.
make[2]: Leaving directory '/home/runner/work/ovs/ovs'
make[1]: *** [all-recursive] Error 1
Makefile:5150: recipe for target 'all-recursive' failed
make[1]: Leaving directory '/home/runner/work/ovs/ovs'
make: *** [all] Error 2
Makefile:2841: recipe for target 'all' failed
##[error]Process completed with exit code 2.
####################################################################################
#### [End job log] "linux gcc --disable-ssl" at step build
####################################################################################




####################################################################################
#### [Begin job log] "linux clang --disable-ssl" at step build
####################################################################################
dumping search index in English (code: en)... done
dumping object inventory... done
build succeeded.

The HTML pages are in Documentation/_build/html.
sphinx-build  -b man -W -n -d ./Documentation/_build/doctrees  ./Documentation ./Documentation/_build/man && touch docs-check
Running Sphinx v4.3.0
Cannot find 'ovs-sphinx-theme' package. Falling back to default theme.
making output directory... done
loading pickled environment... done
building [mo]: targets for 0 po files that are out of date
building [man]: all manpages
updating environment: 0 added, 0 changed, 0 removed
looking for now-outdated files... none found
writing... ovs-actions.7 { } ovs-appctl.8 { } ovs-ctl.8 { } ovs-l3ping.8 { } ovs-parse-backtrace.8 { } ovs-pki.8 { } ovs-sim.1 { } ovs-tcpdump.8 { } ovs-tcpundump.1 { } ovs-test.8 { } ovs-vlan-test.8 { } ovsdb-server.7 { } ovsdb.5 { } ovsdb.7 { } done
build succeeded.

The manual pages are in Documentation/_build/man.
make[2]: Leaving directory '/home/runner/work/ovs/ovs'
Makefile:5150: recipe for target 'all-recursive' failed
make[1]: Leaving directory '/home/runner/work/ovs/ovs'
make[1]: *** [all-recursive] Error 1
make: *** [all] Error 2
Makefile:2841: recipe for target 'all' failed
##[error]Process completed with exit code 2.
####################################################################################
#### [End job log] "linux clang --disable-ssl" at step build
####################################################################################




####################################################################################
#### [Begin job log] "linux gcc test 3.16" at step build
####################################################################################

The HTML pages are in Documentation/_build/html.
sphinx-build  -b man -W -n -d ./Documentation/_build/doctrees  ../../Documentation ./Documentation/_build/man && touch docs-check
Running Sphinx v4.3.0
Cannot find 'ovs-sphinx-theme' package. Falling back to default theme.
making output directory... done
loading pickled environment... done
building [mo]: targets for 0 po files that are out of date
building [man]: all manpages
updating environment: 0 added, 0 changed, 0 removed
looking for now-outdated files... none found
writing... ovs-actions.7 { } ovs-appctl.8 { } ovs-ctl.8 { } ovs-l3ping.8 { } ovs-parse-backtrace.8 { } ovs-pki.8 { } ovs-sim.1 { } ovs-tcpdump.8 { } ovs-tcpundump.1 { } ovs-test.8 { } ovs-vlan-test.8 { } ovsdb-server.7 { } ovsdb.5 { } ovsdb.7 { } done
build succeeded.

The manual pages are in Documentation/_build/man.
make[3]: Leaving directory '/home/runner/work/ovs/ovs/openvswitch-2.16.90/_build/sub'
Makefile:5150: recipe for target 'all-recursive' failed
make[2]: Leaving directory '/home/runner/work/ovs/ovs/openvswitch-2.16.90/_build/sub'
make[2]: *** [all-recursive] Error 1
make[1]: *** [all] Error 2
Makefile:2841: recipe for target 'all' failed
make[1]: Leaving directory '/home/runner/work/ovs/ovs/openvswitch-2.16.90/_build/sub'
make: *** [distcheck] Error 1
Makefile:5359: recipe for target 'distcheck' failed
##[error]Process completed with exit code 2.
####################################################################################
#### [End job log] "linux gcc test 3.16" at step build
####################################################################################




####################################################################################
#### [Begin job log] "linux clang test 3.16 asan" at step build
####################################################################################

The HTML pages are in Documentation/_build/html.
sphinx-build  -b man -W -n -d ./Documentation/_build/doctrees  ../../Documentation ./Documentation/_build/man && touch docs-check
Running Sphinx v4.3.0
Cannot find 'ovs-sphinx-theme' package. Falling back to default theme.
making output directory... done
loading pickled environment... done
building [mo]: targets for 0 po files that are out of date
building [man]: all manpages
updating environment: 0 added, 0 changed, 0 removed
looking for now-outdated files... none found
writing... ovs-actions.7 { } ovs-appctl.8 { } ovs-ctl.8 { } ovs-l3ping.8 { } ovs-parse-backtrace.8 { } ovs-pki.8 { } ovs-sim.1 { } ovs-tcpdump.8 { } ovs-tcpundump.1 { } ovs-test.8 { } ovs-vlan-test.8 { } ovsdb-server.7 { } ovsdb.5 { } ovsdb.7 { } done
build succeeded.

The manual pages are in Documentation/_build/man.
make[3]: Leaving directory '/home/runner/work/ovs/ovs/openvswitch-2.16.90/_build/sub'
make[2]: *** [all-recursive] Error 1
Makefile:5150: recipe for target 'all-recursive' failed
make[2]: Leaving directory '/home/runner/work/ovs/ovs/openvswitch-2.16.90/_build/sub'
make[1]: *** [all] Error 2
Makefile:2841: recipe for target 'all' failed
make[1]: Leaving directory '/home/runner/work/ovs/ovs/openvswitch-2.16.90/_build/sub'
Makefile:5359: recipe for target 'distcheck' failed
make: *** [distcheck] Error 1
##[error]Process completed with exit code 2.
####################################################################################
#### [End job log] "linux clang test 3.16 asan" at step build
####################################################################################




####################################################################################
#### [Begin job log] "linux gcc test --enable-shared" at step build
####################################################################################

The HTML pages are in Documentation/_build/html.
sphinx-build  -b man -W -n -d ./Documentation/_build/doctrees  ../../Documentation ./Documentation/_build/man && touch docs-check
Running Sphinx v4.3.0
Cannot find 'ovs-sphinx-theme' package. Falling back to default theme.
making output directory... done
loading pickled environment... done
building [mo]: targets for 0 po files that are out of date
building [man]: all manpages
updating environment: 0 added, 0 changed, 0 removed
looking for now-outdated files... none found
writing... ovs-actions.7 { } ovs-appctl.8 { } ovs-ctl.8 { } ovs-l3ping.8 { } ovs-parse-backtrace.8 { } ovs-pki.8 { } ovs-sim.1 { } ovs-tcpdump.8 { } ovs-tcpundump.1 { } ovs-test.8 { } ovs-vlan-test.8 { } ovsdb-server.7 { } ovsdb.5 { } ovsdb.7 { } done
build succeeded.

The manual pages are in Documentation/_build/man.
make[3]: Leaving directory '/home/runner/work/ovs/ovs/openvswitch-2.16.90/_build/sub'
make[2]: *** [all-recursive] Error 1
Makefile:5150: recipe for target 'all-recursive' failed
make[2]: Leaving directory '/home/runner/work/ovs/ovs/openvswitch-2.16.90/_build/sub'
make[1]: *** [all] Error 2
Makefile:2841: recipe for target 'all' failed
make[1]: Leaving directory '/home/runner/work/ovs/ovs/openvswitch-2.16.90/_build/sub'
make: *** [distcheck] Error 1
Makefile:5359: recipe for target 'distcheck' failed
##[error]Process completed with exit code 2.
####################################################################################
#### [End job log] "linux gcc test --enable-shared" at step build
####################################################################################




####################################################################################
#### [Begin job log] "linux clang test --enable-shared" at step build
####################################################################################

The HTML pages are in Documentation/_build/html.
sphinx-build  -b man -W -n -d ./Documentation/_build/doctrees  ../../Documentation ./Documentation/_build/man && touch docs-check
Running Sphinx v4.3.0
Cannot find 'ovs-sphinx-theme' package. Falling back to default theme.
making output directory... done
loading pickled environment... done
building [mo]: targets for 0 po files that are out of date
building [man]: all manpages
updating environment: 0 added, 0 changed, 0 removed
looking for now-outdated files... none found
writing... ovs-actions.7 { } ovs-appctl.8 { } ovs-ctl.8 { } ovs-l3ping.8 { } ovs-parse-backtrace.8 { } ovs-pki.8 { } ovs-sim.1 { } ovs-tcpdump.8 { } ovs-tcpundump.1 { } ovs-test.8 { } ovs-vlan-test.8 { } ovsdb-server.7 { } ovsdb.5 { } ovsdb.7 { } done
build succeeded.

The manual pages are in Documentation/_build/man.
make[3]: Leaving directory '/home/runner/work/ovs/ovs/openvswitch-2.16.90/_build/sub'
Makefile:5150: recipe for target 'all-recursive' failed
make[2]: Leaving directory '/home/runner/work/ovs/ovs/openvswitch-2.16.90/_build/sub'
Makefile:2841: recipe for target 'all' failed
make[1]: Leaving directory '/home/runner/work/ovs/ovs/openvswitch-2.16.90/_build/sub'
make[2]: *** [all-recursive] Error 1
make[1]: *** [all] Error 2
make: *** [distcheck] Error 1
Makefile:5359: recipe for target 'distcheck' failed
##[error]Process completed with exit code 2.
####################################################################################
#### [End job log] "linux clang test --enable-shared" at step build
####################################################################################




####################################################################################
#### [Begin job log] "linux gcc test dpdk" at step build
####################################################################################

The HTML pages are in Documentation/_build/html.
sphinx-build  -b man -W -n -d ./Documentation/_build/doctrees  ../../Documentation ./Documentation/_build/man && touch docs-check
Running Sphinx v4.3.0
Cannot find 'ovs-sphinx-theme' package. Falling back to default theme.
making output directory... done
loading pickled environment... done
building [mo]: targets for 0 po files that are out of date
building [man]: all manpages
updating environment: 0 added, 0 changed, 0 removed
looking for now-outdated files... none found
writing... ovs-actions.7 { } ovs-appctl.8 { } ovs-ctl.8 { } ovs-l3ping.8 { } ovs-parse-backtrace.8 { } ovs-pki.8 { } ovs-sim.1 { } ovs-tcpdump.8 { } ovs-tcpundump.1 { } ovs-test.8 { } ovs-vlan-test.8 { } ovsdb-server.7 { } ovsdb.5 { } ovsdb.7 { } done
build succeeded.

The manual pages are in Documentation/_build/man.
make[3]: Leaving directory '/home/runner/work/ovs/ovs/openvswitch-2.16.90/_build/sub'
Makefile:5150: recipe for target 'all-recursive' failed
make[2]: Leaving directory '/home/runner/work/ovs/ovs/openvswitch-2.16.90/_build/sub'
Makefile:2841: recipe for target 'all' failed
make[2]: *** [all-recursive] Error 1
make[1]: Leaving directory '/home/runner/work/ovs/ovs/openvswitch-2.16.90/_build/sub'
make[1]: *** [all] Error 2
make: *** [distcheck] Error 1
Makefile:5359: recipe for target 'distcheck' failed
##[error]Process completed with exit code 2.
####################################################################################
#### [End job log] "linux gcc test dpdk" at step build
####################################################################################




####################################################################################
#### [Begin job log] "linux clang test dpdk" at step build
####################################################################################

The HTML pages are in Documentation/_build/html.
sphinx-build  -b man -W -n -d ./Documentation/_build/doctrees  ../../Documentation ./Documentation/_build/man && touch docs-check
Running Sphinx v4.3.0
Cannot find 'ovs-sphinx-theme' package. Falling back to default theme.
making output directory... done
loading pickled environment... done
building [mo]: targets for 0 po files that are out of date
building [man]: all manpages
updating environment: 0 added, 0 changed, 0 removed
looking for now-outdated files... none found
writing... ovs-actions.7 { } ovs-appctl.8 { } ovs-ctl.8 { } ovs-l3ping.8 { } ovs-parse-backtrace.8 { } ovs-pki.8 { } ovs-sim.1 { } ovs-tcpdump.8 { } ovs-tcpundump.1 { } ovs-test.8 { } ovs-vlan-test.8 { } ovsdb-server.7 { } ovsdb.5 { } ovsdb.7 { } done
build succeeded.

The manual pages are in Documentation/_build/man.
make[3]: Leaving directory '/home/runner/work/ovs/ovs/openvswitch-2.16.90/_build/sub'
Makefile:5150: recipe for target 'all-recursive' failed
make[2]: Leaving directory '/home/runner/work/ovs/ovs/openvswitch-2.16.90/_build/sub'
Makefile:2841: recipe for target 'all' failed
make[1]: Leaving directory '/home/runner/work/ovs/ovs/openvswitch-2.16.90/_build/sub'
make[2]: *** [all-recursive] Error 1
make[1]: *** [all] Error 2
make: *** [distcheck] Error 1
Makefile:5359: recipe for target 'distcheck' failed
##[error]Process completed with exit code 2.
####################################################################################
#### [End job log] "linux clang test dpdk" at step build
####################################################################################




####################################################################################
#### [Begin job log] "linux gcc test -ljemalloc" at step build
####################################################################################

The HTML pages are in Documentation/_build/html.
sphinx-build  -b man -W -n -d ./Documentation/_build/doctrees  ../../Documentation ./Documentation/_build/man && touch docs-check
Running Sphinx v4.3.0
Cannot find 'ovs-sphinx-theme' package. Falling back to default theme.
making output directory... done
loading pickled environment... done
building [mo]: targets for 0 po files that are out of date
building [man]: all manpages
updating environment: 0 added, 0 changed, 0 removed
looking for now-outdated files... none found
writing... ovs-actions.7 { } ovs-appctl.8 { } ovs-ctl.8 { } ovs-l3ping.8 { } ovs-parse-backtrace.8 { } ovs-pki.8 { } ovs-sim.1 { } ovs-tcpdump.8 { } ovs-tcpundump.1 { } ovs-test.8 { } ovs-vlan-test.8 { } ovsdb-server.7 { } ovsdb.5 { } ovsdb.7 { } done
build succeeded.

The manual pages are in Documentation/_build/man.
make[3]: Leaving directory '/home/runner/work/ovs/ovs/openvswitch-2.16.90/_build/sub'
Makefile:5150: recipe for target 'all-recursive' failed
make[2]: Leaving directory '/home/runner/work/ovs/ovs/openvswitch-2.16.90/_build/sub'
make[2]: *** [all-recursive] Error 1
make[1]: *** [all] Error 2
Makefile:2841: recipe for target 'all' failed
make: *** [distcheck] Error 1
make[1]: Leaving directory '/home/runner/work/ovs/ovs/openvswitch-2.16.90/_build/sub'
Makefile:5359: recipe for target 'distcheck' failed
##[error]Process completed with exit code 2.
####################################################################################
#### [End job log] "linux gcc test -ljemalloc" at step build
####################################################################################




####################################################################################
#### [Begin job log] "linux clang test -ljemalloc" at step build
####################################################################################

The HTML pages are in Documentation/_build/html.
sphinx-build  -b man -W -n -d ./Documentation/_build/doctrees  ../../Documentation ./Documentation/_build/man && touch docs-check
Running Sphinx v4.3.0
Cannot find 'ovs-sphinx-theme' package. Falling back to default theme.
making output directory... done
loading pickled environment... done
building [mo]: targets for 0 po files that are out of date
building [man]: all manpages
updating environment: 0 added, 0 changed, 0 removed
looking for now-outdated files... none found
writing... ovs-actions.7 { } ovs-appctl.8 { } ovs-ctl.8 { } ovs-l3ping.8 { } ovs-parse-backtrace.8 { } ovs-pki.8 { } ovs-sim.1 { } ovs-tcpdump.8 { } ovs-tcpundump.1 { } ovs-test.8 { } ovs-vlan-test.8 { } ovsdb-server.7 { } ovsdb.5 { } ovsdb.7 { } done
build succeeded.

The manual pages are in Documentation/_build/man.
make[3]: Leaving directory '/home/runner/work/ovs/ovs/openvswitch-2.16.90/_build/sub'
make[2]: *** [all-recursive] Error 1
Makefile:5150: recipe for target 'all-recursive' failed
make[2]: Leaving directory '/home/runner/work/ovs/ovs/openvswitch-2.16.90/_build/sub'
make[1]: *** [all] Error 2
Makefile:2841: recipe for target 'all' failed
make[1]: Leaving directory '/home/runner/work/ovs/ovs/openvswitch-2.16.90/_build/sub'
make: *** [distcheck] Error 1
Makefile:5359: recipe for target 'distcheck' failed
##[error]Process completed with exit code 2.
####################################################################################
#### [End job log] "linux clang test -ljemalloc" at step build
####################################################################################




####################################################################################
#### [Begin job log] "linux gcc afxdp 5.3" at step build
####################################################################################
dumping search index in English (code: en)... done
dumping object inventory... done
build succeeded.

The HTML pages are in Documentation/_build/html.
sphinx-build  -b man -W -n -d ./Documentation/_build/doctrees  ./Documentation ./Documentation/_build/man && touch docs-check
Running Sphinx v4.3.0
Cannot find 'ovs-sphinx-theme' package. Falling back to default theme.
making output directory... done
loading pickled environment... done
building [mo]: targets for 0 po files that are out of date
building [man]: all manpages
updating environment: 0 added, 0 changed, 0 removed
looking for now-outdated files... none found
writing... ovs-actions.7 { } ovs-appctl.8 { } ovs-ctl.8 { } ovs-l3ping.8 { } ovs-parse-backtrace.8 { } ovs-pki.8 { } ovs-sim.1 { } ovs-tcpdump.8 { } ovs-tcpundump.1 { } ovs-test.8 { } ovs-vlan-test.8 { } ovsdb-server.7 { } ovsdb.5 { } ovsdb.7 { } done
build succeeded.

The manual pages are in Documentation/_build/man.
make[2]: Leaving directory '/home/runner/work/ovs/ovs'
Makefile:5150: recipe for target 'all-recursive' failed
make[1]: Leaving directory '/home/runner/work/ovs/ovs'
Makefile:2841: recipe for target 'all' failed
make[1]: *** [all-recursive] Error 1
make: *** [all] Error 2
##[error]Process completed with exit code 2.
####################################################################################
#### [End job log] "linux gcc afxdp 5.3" at step build
####################################################################################




####################################################################################
#### [Begin job log] "linux clang afxdp 5.3" at step build
####################################################################################
dumping search index in English (code: en)... done
dumping object inventory... done
build succeeded.

The HTML pages are in Documentation/_build/html.
sphinx-build  -b man -W -n -d ./Documentation/_build/doctrees  ./Documentation ./Documentation/_build/man && touch docs-check
Running Sphinx v4.3.0
Cannot find 'ovs-sphinx-theme' package. Falling back to default theme.
making output directory... done
loading pickled environment... done
building [mo]: targets for 0 po files that are out of date
building [man]: all manpages
updating environment: 0 added, 0 changed, 0 removed
looking for now-outdated files... none found
writing... ovs-actions.7 { } ovs-appctl.8 { } ovs-ctl.8 { } ovs-l3ping.8 { } ovs-parse-backtrace.8 { } ovs-pki.8 { } ovs-sim.1 { } ovs-tcpdump.8 { } ovs-tcpundump.1 { } ovs-test.8 { } ovs-vlan-test.8 { } ovsdb-server.7 { } ovsdb.5 { } ovsdb.7 { } done
build succeeded.

The manual pages are in Documentation/_build/man.
make[2]: Leaving directory '/home/runner/work/ovs/ovs'
make[1]: *** [all-recursive] Error 1
Makefile:5150: recipe for target 'all-recursive' failed
make[1]: Leaving directory '/home/runner/work/ovs/ovs'
make: *** [all] Error 2
Makefile:2841: recipe for target 'all' failed
##[error]Process completed with exit code 2.
####################################################################################
#### [End job log] "linux clang afxdp 5.3" at step build
####################################################################################




####################################################################################
#### [Begin job log] "linux gcc dpdk --enable-shared" at step build
####################################################################################
dumping search index in English (code: en)... done
dumping object inventory... done
build succeeded.

The HTML pages are in Documentation/_build/html.
sphinx-build  -b man -W -n -d ./Documentation/_build/doctrees  ./Documentation ./Documentation/_build/man && touch docs-check
Running Sphinx v4.3.0
Cannot find 'ovs-sphinx-theme' package. Falling back to default theme.
making output directory... done
loading pickled environment... done
building [mo]: targets for 0 po files that are out of date
building [man]: all manpages
updating environment: 0 added, 0 changed, 0 removed
looking for now-outdated files... none found
writing... ovs-actions.7 { } ovs-appctl.8 { } ovs-ctl.8 { } ovs-l3ping.8 { } ovs-parse-backtrace.8 { } ovs-pki.8 { } ovs-sim.1 { } ovs-tcpdump.8 { } ovs-tcpundump.1 { } ovs-test.8 { } ovs-vlan-test.8 { } ovsdb-server.7 { } ovsdb.5 { } ovsdb.7 { } done
build succeeded.

The manual pages are in Documentation/_build/man.
make[2]: Leaving directory '/home/runner/work/ovs/ovs'
Makefile:5150: recipe for target 'all-recursive' failed
make[1]: Leaving directory '/home/runner/work/ovs/ovs'
Makefile:2841: recipe for target 'all' failed
make[1]: *** [all-recursive] Error 1
make: *** [all] Error 2
##[error]Process completed with exit code 2.
####################################################################################
#### [End job log] "linux gcc dpdk --enable-shared" at step build
####################################################################################




####################################################################################
#### [Begin job log] "linux clang dpdk --enable-shared" at step build
####################################################################################
dumping search index in English (code: en)... done
dumping object inventory... done
build succeeded.

The HTML pages are in Documentation/_build/html.
sphinx-build  -b man -W -n -d ./Documentation/_build/doctrees  ./Documentation ./Documentation/_build/man && touch docs-check
Running Sphinx v4.3.0
Cannot find 'ovs-sphinx-theme' package. Falling back to default theme.
making output directory... done
loading pickled environment... done
building [mo]: targets for 0 po files that are out of date
building [man]: all manpages
updating environment: 0 added, 0 changed, 0 removed
looking for now-outdated files... none found
writing... ovs-actions.7 { } ovs-appctl.8 { } ovs-ctl.8 { } ovs-l3ping.8 { } ovs-parse-backtrace.8 { } ovs-pki.8 { } ovs-sim.1 { } ovs-tcpdump.8 { } ovs-tcpundump.1 { } ovs-test.8 { } ovs-vlan-test.8 { } ovsdb-server.7 { } ovsdb.5 { } ovsdb.7 { } done
build succeeded.

The manual pages are in Documentation/_build/man.
make[2]: Leaving directory '/home/runner/work/ovs/ovs'
Makefile:5150: recipe for target 'all-recursive' failed
make[1]: Leaving directory '/home/runner/work/ovs/ovs'
Makefile:2841: recipe for target 'all' failed
make[1]: *** [all-recursive] Error 1
make: *** [all] Error 2
##[error]Process completed with exit code 2.
####################################################################################
#### [End job log] "linux clang dpdk --enable-shared" at step build
####################################################################################




####################################################################################
#### [Begin job log] "linux gcc dpdk-shared" at step build
####################################################################################
dumping search index in English (code: en)... done
dumping object inventory... done
build succeeded.

The HTML pages are in Documentation/_build/html.
sphinx-build  -b man -W -n -d ./Documentation/_build/doctrees  ./Documentation ./Documentation/_build/man && touch docs-check
Running Sphinx v4.3.0
Cannot find 'ovs-sphinx-theme' package. Falling back to default theme.
making output directory... done
loading pickled environment... done
building [mo]: targets for 0 po files that are out of date
building [man]: all manpages
updating environment: 0 added, 0 changed, 0 removed
looking for now-outdated files... none found
writing... ovs-actions.7 { } ovs-appctl.8 { } ovs-ctl.8 { } ovs-l3ping.8 { } ovs-parse-backtrace.8 { } ovs-pki.8 { } ovs-sim.1 { } ovs-tcpdump.8 { } ovs-tcpundump.1 { } ovs-test.8 { } ovs-vlan-test.8 { } ovsdb-server.7 { } ovsdb.5 { } ovsdb.7 { } done
build succeeded.

The manual pages are in Documentation/_build/man.
make[2]: Leaving directory '/home/runner/work/ovs/ovs'
make[1]: *** [all-recursive] Error 1
Makefile:5150: recipe for target 'all-recursive' failed
make[1]: Leaving directory '/home/runner/work/ovs/ovs'
make: *** [all] Error 2
Makefile:2841: recipe for target 'all' failed
##[error]Process completed with exit code 2.
####################################################################################
#### [End job log] "linux gcc dpdk-shared" at step build
####################################################################################




####################################################################################
#### [Begin job log] "linux clang dpdk-shared" at step build
####################################################################################
dumping search index in English (code: en)... done
dumping object inventory... done
build succeeded.

The HTML pages are in Documentation/_build/html.
sphinx-build  -b man -W -n -d ./Documentation/_build/doctrees  ./Documentation ./Documentation/_build/man && touch docs-check
Running Sphinx v4.3.0
Cannot find 'ovs-sphinx-theme' package. Falling back to default theme.
making output directory... done
loading pickled environment... done
building [mo]: targets for 0 po files that are out of date
building [man]: all manpages
updating environment: 0 added, 0 changed, 0 removed
looking for now-outdated files... none found
writing... ovs-actions.7 { } ovs-appctl.8 { } ovs-ctl.8 { } ovs-l3ping.8 { } ovs-parse-backtrace.8 { } ovs-pki.8 { } ovs-sim.1 { } ovs-tcpdump.8 { } ovs-tcpundump.1 { } ovs-test.8 { } ovs-vlan-test.8 { } ovsdb-server.7 { } ovsdb.5 { } ovsdb.7 { } done
build succeeded.

The manual pages are in Documentation/_build/man.
make[2]: Leaving directory '/home/runner/work/ovs/ovs'
make[1]: *** [all-recursive] Error 1
Makefile:5150: recipe for target 'all-recursive' failed
make: *** [all] Error 2
make[1]: Leaving directory '/home/runner/work/ovs/ovs'
Makefile:2841: recipe for target 'all' failed
##[error]Process completed with exit code 2.
####################################################################################
#### [End job log] "linux clang dpdk-shared" at step build
####################################################################################




####################################################################################
#### [Begin job log] "linux gcc dpdk-shared --enable-shared" at step build
####################################################################################
dumping search index in English (code: en)... done
dumping object inventory... done
build succeeded.

The HTML pages are in Documentation/_build/html.
sphinx-build  -b man -W -n -d ./Documentation/_build/doctrees  ./Documentation ./Documentation/_build/man && touch docs-check
Running Sphinx v4.3.0
Cannot find 'ovs-sphinx-theme' package. Falling back to default theme.
making output directory... done
loading pickled environment... done
building [mo]: targets for 0 po files that are out of date
building [man]: all manpages
updating environment: 0 added, 0 changed, 0 removed
looking for now-outdated files... none found
writing... ovs-actions.7 { } ovs-appctl.8 { } ovs-ctl.8 { } ovs-l3ping.8 { } ovs-parse-backtrace.8 { } ovs-pki.8 { } ovs-sim.1 { } ovs-tcpdump.8 { } ovs-tcpundump.1 { } ovs-test.8 { } ovs-vlan-test.8 { } ovsdb-server.7 { } ovsdb.5 { } ovsdb.7 { } done
build succeeded.

The manual pages are in Documentation/_build/man.
make[2]: Leaving directory '/home/runner/work/ovs/ovs'
make[1]: *** [all-recursive] Error 1
Makefile:5150: recipe for target 'all-recursive' failed
make: *** [all] Error 2
make[1]: Leaving directory '/home/runner/work/ovs/ovs'
Makefile:2841: recipe for target 'all' failed
##[error]Process completed with exit code 2.
####################################################################################
#### [End job log] "linux gcc dpdk-shared --enable-shared" at step build
####################################################################################




####################################################################################
#### [Begin job log] "linux clang dpdk-shared --enable-shared" at step build
####################################################################################
dumping search index in English (code: en)... done
dumping object inventory... done
build succeeded.

The HTML pages are in Documentation/_build/html.
sphinx-build  -b man -W -n -d ./Documentation/_build/doctrees  ./Documentation ./Documentation/_build/man && touch docs-check
Running Sphinx v4.3.0
Cannot find 'ovs-sphinx-theme' package. Falling back to default theme.
making output directory... done
loading pickled environment... done
building [mo]: targets for 0 po files that are out of date
building [man]: all manpages
updating environment: 0 added, 0 changed, 0 removed
looking for now-outdated files... none found
writing... ovs-actions.7 { } ovs-appctl.8 { } ovs-ctl.8 { } ovs-l3ping.8 { } ovs-parse-backtrace.8 { } ovs-pki.8 { } ovs-sim.1 { } ovs-tcpdump.8 { } ovs-tcpundump.1 { } ovs-test.8 { } ovs-vlan-test.8 { } ovsdb-server.7 { } ovsdb.5 { } ovsdb.7 { } done
build succeeded.

The manual pages are in Documentation/_build/man.
make[2]: Leaving directory '/home/runner/work/ovs/ovs'
Makefile:5150: recipe for target 'all-recursive' failed
make[1]: Leaving directory '/home/runner/work/ovs/ovs'
make[1]: *** [all-recursive] Error 1
Makefile:2841: recipe for target 'all' failed
make: *** [all] Error 2
##[error]Process completed with exit code 2.
####################################################################################
#### [End job log] "linux clang dpdk-shared --enable-shared" at step build
####################################################################################




####################################################################################
#### [Begin job log] "linux gcc m32 --disable-ssl" at step build
####################################################################################
dumping search index in English (code: en)... done
dumping object inventory... done
build succeeded.

The HTML pages are in Documentation/_build/html.
sphinx-build  -b man -W -n -d ./Documentation/_build/doctrees  ./Documentation ./Documentation/_build/man && touch docs-check
Running Sphinx v4.3.0
Cannot find 'ovs-sphinx-theme' package. Falling back to default theme.
making output directory... done
loading pickled environment... done
building [mo]: targets for 0 po files that are out of date
building [man]: all manpages
updating environment: 0 added, 0 changed, 0 removed
looking for now-outdated files... none found
writing... ovs-actions.7 { } ovs-appctl.8 { } ovs-ctl.8 { } ovs-l3ping.8 { } ovs-parse-backtrace.8 { } ovs-pki.8 { } ovs-sim.1 { } ovs-tcpdump.8 { } ovs-tcpundump.1 { } ovs-test.8 { } ovs-vlan-test.8 { } ovsdb-server.7 { } ovsdb.5 { } ovsdb.7 { } done
build succeeded.

The manual pages are in Documentation/_build/man.
make[2]: Leaving directory '/home/runner/work/ovs/ovs'
Makefile:5150: recipe for target 'all-recursive' failed
make[1]: Leaving directory '/home/runner/work/ovs/ovs'
Makefile:2841: recipe for target 'all' failed
make[1]: *** [all-recursive] Error 1
make: *** [all] Error 2
##[error]Process completed with exit code 2.
####################################################################################
#### [End job log] "linux gcc m32 --disable-ssl" at step build
####################################################################################
--------------------------------END LOGS-----------------------------


More information about the build mailing list