[ovs-build] |fail| pw1523760 [ovs-dev] [OVN Patch v6 3/4] northd: Optimize dp groups operations

0-day Robot robot at bytheb.org
Thu Sep 2 16:01:55 UTC 2021


From: robot at bytheb.org

Test-Label: github-robot: ovn-kubernetes
Test-Status: fail
http://patchwork.ozlabs.org/api/patches/1523760/

_github build: failed_
Build URL: https://github.com/ovsrobot/ovn/actions/runs/1194415144
Build Logs:
-----------------------Summary of failed steps-----------------------
"e2e (shard-conformance, false, false, false, ipv4, IPv4, true, false)" failed at step Run Tests
"e2e (shard-conformance, false, false, false, ipv4, IPv4, true, false)" failed at step Generate Test Report
"e2e (shard-conformance, false, false, false, ipv6, IPv6, false, true)" failed at step Run Tests
"e2e (shard-conformance, false, false, false, ipv6, IPv6, false, true)" failed at step Generate Test Report
"e2e (shard-conformance, false, false, false, dualstack, Dualstack, true, true)" failed at step Run Tests
"e2e (shard-conformance, false, false, false, dualstack, Dualstack, true, true)" failed at step Generate Test Report
"e2e (control-plane, true, true, true, ipv4, IPv4, true, false)" failed at step Run Tests
"e2e (control-plane, true, true, true, ipv4, IPv4, true, false)" failed at step Generate Test Report
----------------------End summary of failed steps--------------------

-------------------------------BEGIN LOGS----------------------------
####################################################################################
#### [Begin job log] "e2e (shard-conformance, false, false, false, ipv4, IPv4, true, false)" at step Run Tests
####################################################################################

[Fail] [sig-network] NetworkPolicy [LinuxOnly] NetworkPolicy between server and client [It] should enforce policy to allow traffic only from a pod in a different namespace based on PodSelector and NamespaceSelector [Feature:NetworkPolicy] 
/go/src/k8s.io/kubernetes/_output/local/go/src/k8s.io/kubernetes/test/e2e/network/network_policy.go:1926

[Fail] [sig-network] NetworkPolicy [LinuxOnly] NetworkPolicy between server and client [It] should ensure an IP overlapping both IPBlock.CIDR and IPBlock.Except is allowed [Feature:NetworkPolicy] 
/go/src/k8s.io/kubernetes/_output/local/go/src/k8s.io/kubernetes/test/e2e/network/network_policy.go:1907

[Fail] [sig-network] NetworkPolicy [LinuxOnly] NetworkPolicy between server and client [It] should enforce policy based on PodSelector and NamespaceSelector [Feature:NetworkPolicy] 
/go/src/k8s.io/kubernetes/_output/local/go/src/k8s.io/kubernetes/test/e2e/network/network_policy.go:1907

[Fail] [sig-network] NetworkPolicy [LinuxOnly] NetworkPolicy between server and client [It] should enforce updated policy [Feature:NetworkPolicy] 
/go/src/k8s.io/kubernetes/_output/local/go/src/k8s.io/kubernetes/test/e2e/network/network_policy.go:1907

[Fail] [sig-network] DNS [It] should provide DNS for ExternalName services [Conformance] 
/go/src/k8s.io/kubernetes/_output/local/go/src/k8s.io/kubernetes/test/e2e/network/dns_common.go:464

Ran 207 of 5668 Specs in 1974.164 seconds
FAIL! -- 206 Passed | 1 Failed | 13 Flaked | 0 Pending | 5461 Skipped


Ginkgo ran 1 suite in 33m16.149568957s
Test Suite Failed
make: *** [Makefile:21: shard-conformance] Error 1
make: Leaving directory '/home/runner/work/ovn/ovn/src/github.com/ovn-org/ovn-kubernetes/test'
##[error]Process completed with exit code 2.
####################################################################################
#### [End job log] "e2e (shard-conformance, false, false, false, ipv4, IPv4, true, false)" at step Run Tests
####################################################################################




####################################################################################
#### [Begin job log] "e2e (shard-conformance, false, false, false, ipv4, IPv4, true, false)" at step Generate Test Report
####################################################################################
  <testsuite name="Kubernetes e2e suite" tests="2" failures="0" errors="0" time="1467.571">
  <testsuite name="Kubernetes e2e suite" tests="2" failures="0" errors="0" time="1467.571">
  <testsuite name="Kubernetes e2e suite" tests="4" failures="0" errors="0" time="1555.022">
  <testsuite name="Kubernetes e2e suite" tests="4" failures="0" errors="0" time="1555.022">
  <testsuite name="Kubernetes e2e suite" tests="4" failures="0" errors="0" time="1555.022">
  <testsuite name="Kubernetes e2e suite" tests="3" failures="0" errors="0" time="1412.887">
  <testsuite name="Kubernetes e2e suite" tests="3" failures="0" errors="0" time="1412.887">
  <testsuite name="Kubernetes e2e suite" tests="3" failures="0" errors="0" time="1412.887">
  <testsuite name="Kubernetes e2e suite" tests="5" failures="0" errors="0" time="1318.407">
  <testsuite name="Kubernetes e2e suite" tests="5" failures="0" errors="0" time="1318.407">
  <testsuite name="Kubernetes e2e suite" tests="5" failures="0" errors="0" time="1318.407">
  <testsuite name="Kubernetes e2e suite" tests="22" failures="0" errors="0" time="1545.506">
  <testsuite name="Kubernetes e2e suite" tests="22" failures="0" errors="0" time="1545.506">
  <testsuite name="Kubernetes e2e suite" tests="22" failures="0" errors="0" time="1545.506">
  <testsuite name="Kubernetes e2e suite" tests="5" failures="0" errors="0" time="1307.42">
  <testsuite name="Kubernetes e2e suite" tests="5" failures="0" errors="0" time="1307.42">
  <testsuite name="Kubernetes e2e suite" tests="5" failures="0" errors="0" time="1307.42">
  <testsuite name="Kubernetes e2e suite" tests="10" failures="0" errors="0" time="1399.7">
  <testsuite name="Kubernetes e2e suite" tests="10" failures="0" errors="0" time="1399.7">
  <testsuite name="Kubernetes e2e suite" tests="10" failures="0" errors="0" time="1399.7">
  <testsuite name="Kubernetes e2e suite" tests="14" failures="0" errors="0" time="1342.486">
  <testsuite name="Kubernetes e2e suite" tests="14" failures="0" errors="0" time="1342.486">
  <testsuite name="Kubernetes e2e suite" tests="14" failures="0" errors="0" time="1342.486">
  <testsuite name="Kubernetes e2e suite" tests="8" failures="1" errors="0" time="1334.762">
Failure found in src/github.com/ovn-org/ovn-kubernetes/test/_artifacts//junit_19.xml:   <testsuite name="Kubernetes e2e suite" tests="8" failures="1" errors="0" time="1334.762">
####################################################################################
#### [End job log] "e2e (shard-conformance, false, false, false, ipv4, IPv4, true, false)" at step Generate Test Report
####################################################################################




####################################################################################
#### [Begin job log] "e2e (shard-conformance, false, false, false, ipv6, IPv6, false, true)" at step Run Tests
####################################################################################

[Fail] [sig-network] Services [It] should be able to change the type from NodePort to ExternalName [Conformance] 
/go/src/k8s.io/kubernetes/_output/local/go/src/k8s.io/kubernetes/test/e2e/network/service.go:1818

[Fail] [sig-network] NetworkPolicy [LinuxOnly] NetworkPolicy between server and client [It] should enforce updated policy [Feature:NetworkPolicy] 
/go/src/k8s.io/kubernetes/_output/local/go/src/k8s.io/kubernetes/test/e2e/network/network_policy.go:1907

[Fail] [sig-network] NetworkPolicy [LinuxOnly] NetworkPolicy between server and client [It] should enforce multiple egress policies with egress allow-all policy taking precedence [Feature:NetworkPolicy] 
/go/src/k8s.io/kubernetes/_output/local/go/src/k8s.io/kubernetes/test/e2e/network/network_policy.go:1907

[Fail] [sig-network] Services [It] should be able to change the type from NodePort to ExternalName [Conformance] 
/go/src/k8s.io/kubernetes/_output/local/go/src/k8s.io/kubernetes/test/e2e/network/service.go:1818

[Fail] [sig-network] Services [It] should be able to change the type from NodePort to ExternalName [Conformance] 
/go/src/k8s.io/kubernetes/_output/local/go/src/k8s.io/kubernetes/test/e2e/network/service.go:1818

Ran 204 of 5668 Specs in 1797.423 seconds
FAIL! -- 202 Passed | 2 Failed | 17 Flaked | 0 Pending | 5464 Skipped


Ginkgo ran 1 suite in 30m21.201476049s
Test Suite Failed
make: *** [Makefile:21: shard-conformance] Error 1
make: Leaving directory '/home/runner/work/ovn/ovn/src/github.com/ovn-org/ovn-kubernetes/test'
##[error]Process completed with exit code 2.
####################################################################################
#### [End job log] "e2e (shard-conformance, false, false, false, ipv6, IPv6, false, true)" at step Run Tests
####################################################################################




####################################################################################
#### [Begin job log] "e2e (shard-conformance, false, false, false, ipv6, IPv6, false, true)" at step Generate Test Report
####################################################################################
  <testsuite name="Kubernetes e2e suite" tests="8" failures="0" errors="0" time="1508.647">
  <testsuite name="Kubernetes e2e suite" tests="8" failures="0" errors="0" time="1508.647">
  <testsuite name="Kubernetes e2e suite" tests="2" failures="0" errors="0" time="1587.331">
  <testsuite name="Kubernetes e2e suite" tests="2" failures="0" errors="0" time="1587.331">
  <testsuite name="Kubernetes e2e suite" tests="2" failures="0" errors="0" time="1587.331">
  <testsuite name="Kubernetes e2e suite" tests="11" failures="0" errors="0" time="1618.128">
  <testsuite name="Kubernetes e2e suite" tests="11" failures="0" errors="0" time="1618.128">
  <testsuite name="Kubernetes e2e suite" tests="11" failures="0" errors="0" time="1618.128">
  <testsuite name="Kubernetes e2e suite" tests="11" failures="0" errors="0" time="1530.845">
  <testsuite name="Kubernetes e2e suite" tests="11" failures="0" errors="0" time="1530.845">
  <testsuite name="Kubernetes e2e suite" tests="11" failures="0" errors="0" time="1530.845">
  <testsuite name="Kubernetes e2e suite" tests="20" failures="0" errors="0" time="1421.654">
  <testsuite name="Kubernetes e2e suite" tests="20" failures="0" errors="0" time="1421.654">
  <testsuite name="Kubernetes e2e suite" tests="20" failures="0" errors="0" time="1421.654">
  <testsuite name="Kubernetes e2e suite" tests="19" failures="0" errors="0" time="1430.311">
  <testsuite name="Kubernetes e2e suite" tests="19" failures="0" errors="0" time="1430.311">
  <testsuite name="Kubernetes e2e suite" tests="19" failures="0" errors="0" time="1430.311">
  <testsuite name="Kubernetes e2e suite" tests="9" failures="0" errors="0" time="1520.961">
  <testsuite name="Kubernetes e2e suite" tests="9" failures="0" errors="0" time="1520.961">
  <testsuite name="Kubernetes e2e suite" tests="9" failures="0" errors="0" time="1520.961">
  <testsuite name="Kubernetes e2e suite" tests="12" failures="0" errors="0" time="1662.133">
  <testsuite name="Kubernetes e2e suite" tests="12" failures="0" errors="0" time="1662.133">
  <testsuite name="Kubernetes e2e suite" tests="12" failures="0" errors="0" time="1662.133">
  <testsuite name="Kubernetes e2e suite" tests="16" failures="1" errors="0" time="1462.798">
Failure found in src/github.com/ovn-org/ovn-kubernetes/test/_artifacts//junit_17.xml:   <testsuite name="Kubernetes e2e suite" tests="16" failures="1" errors="0" time="1462.798">
####################################################################################
#### [End job log] "e2e (shard-conformance, false, false, false, ipv6, IPv6, false, true)" at step Generate Test Report
####################################################################################




####################################################################################
#### [Begin job log] "e2e (shard-conformance, false, false, false, dualstack, Dualstack, true, true)" at step Run Tests
####################################################################################
/go/src/k8s.io/kubernetes/_output/local/go/src/k8s.io/kubernetes/test/e2e/network/network_policy.go:1907

[Fail] [sig-network] Services [It] should preserve source pod IP for traffic thru service cluster IP [LinuxOnly] 
/go/src/k8s.io/kubernetes/_output/local/go/src/k8s.io/kubernetes/test/e2e/network/service.go:992

[Fail] [sig-network] NetworkPolicy [LinuxOnly] NetworkPolicy between server and client [It] should enforce policy based on PodSelector with MatchExpressions[Feature:NetworkPolicy] 
/go/src/k8s.io/kubernetes/_output/local/go/src/k8s.io/kubernetes/test/e2e/network/network_policy.go:1920

[Fail] [sig-network] Services [It] should preserve source pod IP for traffic thru service cluster IP [LinuxOnly] 
/go/src/k8s.io/kubernetes/_output/local/go/src/k8s.io/kubernetes/test/e2e/network/service.go:992

[Fail] [sig-network] NetworkPolicy [LinuxOnly] NetworkPolicy between server and client [It] should enforce policy based on PodSelector with MatchExpressions[Feature:NetworkPolicy] 
/go/src/k8s.io/kubernetes/_output/local/go/src/k8s.io/kubernetes/test/e2e/network/network_policy.go:1907

[Fail] [sig-network] NetworkPolicy [LinuxOnly] NetworkPolicy between server and client [It] should ensure an IP overlapping both IPBlock.CIDR and IPBlock.Except is allowed [Feature:NetworkPolicy] 
/go/src/k8s.io/kubernetes/_output/local/go/src/k8s.io/kubernetes/test/e2e/network/network_policy.go:1907

Ran 226 of 5668 Specs in 2076.236 seconds
FAIL! -- 220 Passed | 6 Failed | 16 Flaked | 0 Pending | 5442 Skipped


Ginkgo ran 1 suite in 35m0.89662298s
Test Suite Failed
make: Leaving directory '/home/runner/work/ovn/ovn/src/github.com/ovn-org/ovn-kubernetes/test'
##[error]Process completed with exit code 2.
####################################################################################
#### [End job log] "e2e (shard-conformance, false, false, false, dualstack, Dualstack, true, true)" at step Run Tests
####################################################################################




####################################################################################
#### [Begin job log] "e2e (shard-conformance, false, false, false, dualstack, Dualstack, true, true)" at step Generate Test Report
####################################################################################

Thu Sep  2 14:35:48 UTC 2021 Try: 1457

Thu Sep  2 14:35:48 UTC 2021 Try: 1458

Thu Sep  2 14:35:48 UTC 2021 Try: 1459

Thu Sep  2 14:35:48 UTC 2021 Try: 1460

Thu Sep::set-output name=report-file::src/github.com/ovn-org/ovn-kubernetes/test/_artifacts//index.html
Inspecting 'src/github.com/ovn-org/ovn-kubernetes/test/_artifacts/'
  <testsuite name="Kubernetes e2e suite" tests="8" failures="0" errors="0" time="2075.199">
  <testsuite name="Kubernetes e2e suite" tests="8" failures="0" errors="0" time="2075.199">
  <testsuite name="Kubernetes e2e suite" tests="8" failures="0" errors="0" time="2075.199">
  <testsuite name="Kubernetes e2e suite" tests="8" failures="0" errors="0" time="1827.001">
  <testsuite name="Kubernetes e2e suite" tests="8" failures="0" errors="0" time="1827.001">
  <testsuite name="Kubernetes e2e suite" tests="8" failures="0" errors="0" time="1827.001">
  <testsuite name="Kubernetes e2e suite" tests="16" failures="0" errors="0" time="1655.633">
  <testsuite name="Kubernetes e2e suite" tests="16" failures="0" errors="0" time="1655.633">
  <testsuite name="Kubernetes e2e suite" tests="16" failures="0" errors="0" time="1655.633">
  <testsuite name="Kubernetes e2e suite" tests="7" failures="0" errors="0" time="1660.155">
  <testsuite name="Kubernetes e2e suite" tests="7" failures="0" errors="0" time="1660.155">
  <testsuite name="Kubernetes e2e suite" tests="7" failures="0" errors="0" time="1660.155">
  <testsuite name="Kubernetes e2e suite" tests="12" failures="1" errors="0" time="1938.772">
Failure found in src/github.com/ovn-org/ovn-kubernetes/test/_artifacts//junit_05.xml:   <testsuite name="Kubernetes e2e suite" tests="12" failures="1" errors="0" time="1938.772">
####################################################################################
#### [End job log] "e2e (shard-conformance, false, false, false, dualstack, Dualstack, true, true)" at step Generate Test Report
####################################################################################




####################################################################################
#### [Begin job log] "e2e (control-plane, true, true, true, ipv4, IPv4, true, false)" at step Run Tests
####################################################################################
/home/runner/work/ovn/ovn/src/github.com/ovn-org/ovn-kubernetes/test/e2e/unidling.go:239

[Fail] e2e ingress traffic validation Validating ExternalIP ingress traffic to manually added node IPs [It] Should be allowed by externalip services to a new node ip 
/home/runner/work/ovn/ovn/src/github.com/ovn-org/ovn-kubernetes/test/e2e/util.go:255

[Fail] e2e ingress traffic validation Validating ExternalIP ingress traffic to manually added node IPs [It] Should be allowed by externalip services to a new node ip 
/home/runner/work/ovn/ovn/src/github.com/ovn-org/ovn-kubernetes/test/e2e/util.go:255

[Fail] Unidling With annotated service [It] Should generate a NeedPods event for traffic destined to idled services 
/home/runner/work/ovn/ovn/src/github.com/ovn-org/ovn-kubernetes/test/e2e/unidling.go:157

[Fail] Unidling With annotated service [It] Should generate a NeedPods event for traffic destined to idled services 
/home/runner/work/ovn/ovn/src/github.com/ovn-org/ovn-kubernetes/test/e2e/unidling.go:157

[Fail] Unidling With non annotated service [It] Should not generate a NeedPods event when backends were added and then removed 
/home/runner/work/ovn/ovn/src/github.com/ovn-org/ovn-kubernetes/test/e2e/unidling.go:277

Ran 47 of 60 Specs in 5420.835 seconds
FAIL! -- 40 Passed | 7 Failed | 1 Flaked | 0 Pending | 13 Skipped
--- FAIL: TestE2e (5420.85s)
FAIL
FAIL	github.com/ovn-org/ovn-kubernetes/test/e2e	5420.905s
FAIL
make: Leaving directory '/home/runner/work/ovn/ovn/src/github.com/ovn-org/ovn-kubernetes/test'
##[error]Process completed with exit code 2.
####################################################################################
#### [End job log] "e2e (control-plane, true, true, true, ipv4, IPv4, true, false)" at step Run Tests
####################################################################################




####################################################################################
#### [Begin job log] "e2e (control-plane, true, true, true, ipv4, IPv4, true, false)" at step Generate Test Report
####################################################################################
Sep  2 15:21:26.805: INFO: 	Container nb-ovsdb ready: true, restart count 0
Sep  2 15:21:26.805: INFO: 	Container ovn-dbchecker ready: true, restart count 0
Sep  2 15:21:26.805: INFO: 	Container sb-ovsdb ready: true, restart count 0
Sep  2 15:21:26.805: INFO: ovs-node-gk2dc started at 2021-09-02 14:13:18 +0000 UTC (0+1 container statuses recorded)
Sep  2 15:21:26.805: INFO: 	Container ovs-daemons ready: true, restart count 0
Sep  2 15:21:26.805: INFO: ovnkube-master-676d55b958-bl6jl started at 2021-09-02 14:13:19 +0000 UTC (0+3 container statuses recorded)
Sep  2 15:21:26.805: INFO: 	Container nbctl-daemon ready: true, restart count 0
Sep  2 15:21:26.805: INFO: 	Container ovn-northd ready: true, restart count 0
Sep  2 15:21:26.805: INFO: 	Container ovnkube-master ready: true, restart count 0
Sep  2 15:21:26.805: INFO: ovnkube-node-hdjft started at 2021-09-02 14:47:41 +0000 UTC (0+3 container statuses recorded)
Sep  2 15:21:26.805: INFO: 	Container ovn-controller ready: true, restart count 0
Sep  2 15:21:26.805: INFO: 	Container ovnkube-node ready: true, restart count 0
Sep  2 15:21:26.805: INFO: 	Container ovs-metrics-exporter ready: true, restart count 0
Sep  2 15:21:26.805: INFO: local-path-provisioner-78776bfc44-5vxrt started at 2021-09-02 14:14:07 +0000 UTC (0+1 container statuses recorded)
Sep  2 15:21:26.805: INFO: 	Container local-path-provisioner ready: true, restart count 0
Sep  2 15:21:26.805: INFO: pod-server2 started at 2021-09-02 15:20:52 +0000 UTC (0+1 container statuses recorded)
Sep  2 15:21:26.805: INFO: 	Container pod-server2 ready: false, restart count 0
Sep  2 15:21:27.024: INFO: 
Latency metrics for node ovn-worker
Sep  2 15:21:27.025: INFO: 
Logging node info for node ovn-worker2
Se::set-output name=report-file::src/github.com/ovn-org/ovn-kubernetes/test/_artifacts//index.html
Inspecting 'src/github.com/ovn-org/ovn-kubernetes/test/_artifacts/'
  <testsuite name="E2e Suite" tests="47" failures="7" errors="0" time="5420.835">
Failure found in src/github.com/ovn-org/ovn-kubernetes/test/_artifacts//junit_control-plane-IPv4_01.xml:   <testsuite name="E2e Suite" tests="47" failures="7" errors="0" time="5420.835">
####################################################################################
#### [End job log] "e2e (control-plane, true, true, true, ipv4, IPv4, true, false)" at step Generate Test Report
####################################################################################
--------------------------------END LOGS-----------------------------


More information about the build mailing list