[ovs-build] |fail| pw1524349 [ovs-dev] [OVN Patch v2] Make changes to the parallel processing API to allow pool sizing

0-day Robot robot at bytheb.org
Fri Sep 3 15:01:17 UTC 2021


From: robot at bytheb.org

Test-Label: github-robot: ovn-kubernetes
Test-Status: fail
http://patchwork.ozlabs.org/api/patches/1524349/

_github build: failed_
Build URL: https://github.com/ovsrobot/ovn/actions/runs/1198388191
Build Logs:
-----------------------Summary of failed steps-----------------------
"Build" failed at step Build ovn-kubernetes container
----------------------End summary of failed steps--------------------

-------------------------------BEGIN LOGS----------------------------
####################################################################################
#### [Begin job log] "Build" at step Build ovn-kubernetes container
####################################################################################
/bin/sh ./libtool  --tag=CC   --mode=link gcc -Wstrict-prototypes -Wall -Wextra -Wno-sign-compare -Wpointer-arith -Wformat -Wformat-security -Wswitch-enum -Wunused-parameter -Wbad-function-cast -Wcast-align -Wstrict-prototypes -Wold-style-definition -Wmissing-prototypes -Wmissing-field-initializers -fno-strict-aliasing -Wswitch-bool -Wlogical-not-parentheses -Wsizeof-array-argument -Wbool-compare -Wshift-negative-value -Wduplicated-cond -Wshadow -Wmultistatement-macros -Wcast-align=strict   -O2 -flto=auto -ffat-lto-objects -fexceptions -g -grecord-gcc-switches -pipe -Wall -Werror=format-security -Wp,-D_FORTIFY_SOURCE=2 -Wp,-D_GLIBCXX_ASSERTIONS -specs=/usr/lib/rpm/redhat/redhat-hardened-cc1 -fstack-protector-strong -specs=/usr/lib/rpm/redhat/redhat-annobin-cc1  -m64 -mtune=generic -fasynchronous-unwind-tables -fstack-clash-protection -fcf-protection    -Wl,-z,relro -Wl,--as-needed  -Wl,-z,now -specs=/usr/lib/rpm/redhat/redhat-hardened-ld  -o ic/ovn-ic ic/ovn-ic.o lib/libovn.la /tmp/ovn/rpm/rpmbuild/BUILD/ovn-21.06.90/openvswitch-2.15.90/ovsdb/libovsdb.la /tmp/ovn/rpm/rpmbuild/BUILD/ovn-21.06.90/openvswitch-2.15.90/lib/libopenvswitch.la -lpthread -lrt -lm  -lunbound
libtool: link: gcc -Wstrict-prototypes -Wall -Wextra -Wno-sign-compare -Wpointer-arith -Wformat -Wformat-security -Wswitch-enum -Wunused-parameter -Wbad-function-cast -Wcast-align -Wstrict-prototypes -Wold-style-definition -Wmissing-prototypes -Wmissing-field-initializers -fno-strict-aliasing -Wswitch-bool -Wlogical-not-parentheses -Wsizeof-array-argument -Wbool-compare -Wshift-negative-value -Wduplicated-cond -Wshadow -Wmultistatement-macros -Wcast-align=strict -O2 -flto=auto -ffat-lto-objects -fexceptions -g -grecord-gcc-switches -pipe -Wall -Werror=format-security -Wp,-D_FORTIFY_SOURCE=2 -Wp,-D_GLIBCXX_ASSERTIONS -specs=/usr/lib/rpm/redhat/redhat-hardened-cc1 -fstack-protector-strong -specs=/usr/lib/rpm/redhat/redhat-annobin-cc1 -m64 -mtune=generic -fasynchronous-unwind-tables -fstack-clash-protection -fcf-protection -Wl,-z -Wl,relro -Wl,--as-needed -Wl,-z -Wl,now -specs=/usr/lib/rpm/redhat/redhat-hardened-ld -o ic/ovn-ic ic/ovn-ic.o  lib/.libs/libovn.a /tmp/ovn/rpm/rpmbuild/BUILD/ovn-21.06.90/openvswitch-2.15.90/ovsdb/.libs/libovsdb.a /tmp/ovn/rpm/rpmbuild/BUILD/ovn-21.06.90/openvswitch-2.15.90/lib/.libs/libopenvswitch.a -lssl -lcrypto -lcap-ng /tmp/ovn/rpm/rpmbuild/BUILD/ovn-21.06.90/openvswitch-2.15.90/lib/.libs/libopenvswitchavx512.a -lpthread -lrt -lm -lunbound
/usr/bin/ld: /tmp/ovn-controller.0WkZ0a.ltrans5.ltrans.o: in function `main':
/tmp/ovn/rpm/rpmbuild/BUILD/ovn-21.06.90/controller/ovn-controller.c:3523: undefined reference to `ovsrec_server_has_datapath_table'
collect2: error: ld returned 1 exit status
make[2]: *** [Makefile:1775: controller/ovn-controller] Error 1
make[2]: *** Waiting for unfinished jobs....
make[2]: Leaving directory '/tmp/ovn/rpm/rpmbuild/BUILD/ovn-21.06.90'
make[1]: Leaving directory '/tmp/ovn/rpm/rpmbuild/BUILD/ovn-21.06.90'
make[1]: *** [Makefile:1462: all] Error 2
error: Bad exit status from /var/tmp/rpm-tmp.6xXTcr (%build)
    line 33: Possible unexpanded macro in: Obsoletes: openvswitch-ovn-common < 21.06.90-%{release}


RPM build errors:
    line 34: Possible unexpanded macro in: Provides: openvswitch-ovn-common = 21.06.90-%{release}
    line 81: It's not recommended to have unversioned Obsoletes: Obsoletes: openvswitch-ovn-central
    line 92: It's not recommended to have unversioned Obsoletes: Obsoletes: openvswitch-ovn-host
    line 102: It's not recommended to have unversioned Obsoletes: Obsoletes: openvswitch-ovn-vtep
    line 112: It's not recommended to have unversioned Obsoletes: Obsoletes: openvswitch-ovn-docker
    Bad exit status from /var/tmp/rpm-tmp.6xXTcr (%build)
make: *** [Makefile:3639: rpm-fedora] Error 1
The command '/bin/sh -c make rpm-fedora' returned a non-zero code: 2

##[error]Process completed with exit code 2.
####################################################################################
#### [End job log] "Build" at step Build ovn-kubernetes container
####################################################################################
--------------------------------END LOGS-----------------------------


More information about the build mailing list