[ovs-build] |fail| pw1524525 [ovs-dev] [PATCH ovn v4 6/9] lib: Add infrastructure for plugging providers.

0-day Robot robot at bytheb.org
Fri Sep 3 20:20:34 UTC 2021


From: robot at bytheb.org

Test-Label: github-robot: Build and Test
Test-Status: fail
http://patchwork.ozlabs.org/api/patches/1524525/

_github build: failed_
Build URL: https://github.com/ovsrobot/ovn/actions/runs/1199219755
Build Logs:
-----------------------Summary of failed steps-----------------------
"osx clang --disable-ssl" failed at step build
"linux gcc --disable-ssl" failed at step build
"linux clang --disable-ssl" failed at step build
"linux gcc system-test" failed at step build
"linux clang test asan" failed at step build
"linux gcc test -ljemalloc" failed at step build
"linux clang test -ljemalloc" failed at step build
"linux gcc m32 --disable-ssl" failed at step build
----------------------End summary of failed steps--------------------

-------------------------------BEGIN LOGS----------------------------
####################################################################################
#### [Begin job log] "osx clang --disable-ssl" at step build
####################################################################################
#define HAVE_PRAGMA_MESSAGE 1

configure: exit 0

## ---------------------- ##
## Running config.status. ##
## ---------------------- ##

This file was extended by ovn config.status 21.06.90, which was
generated by GNU Autoconf 2.71.  Invocation command line was

  CONFIG_FILES    = 
  CONFIG_HEADERS  = 
  CONFIG_LINKS    = 
  CONFIG_COMMANDS = 
  $ ./config.status Makefile depfiles

on Mac-1630695657825.local

config.status:1309: creating Makefile
config.status:1538: executing depfiles commands
config.status:1640: cd .       && sed -e '/# am--include-marker/d' Makefile         | make -f - am--depfiles
make[1]: Nothing to be done for `am--depfiles'.
config.status:1645: $? = 0
##[error]Process completed with exit code 1.
####################################################################################
#### [End job log] "osx clang --disable-ssl" at step build
####################################################################################




####################################################################################
#### [Begin job log] "linux gcc --disable-ssl" at step build
####################################################################################

## ---------------------- ##
## Running config.status. ##
## ---------------------- ##

This file was extended by ovn config.status 21.06.90, which was
generated by GNU Autoconf 2.69.  Invocation command line was

  CONFIG_FILES    = 
  CONFIG_HEADERS  = 
  CONFIG_LINKS    = 
  CONFIG_COMMANDS = 
  $ ./config.status Makefile depfiles

on fv-az133-997

config.status:1310: creating Makefile
config.status:1539: executing depfiles commands
config.status:1639: cd .       && sed -e '/# am--include-marker/d' Makefile         | make -f - am--depfiles
make[1]: warning: jobserver unavailable: using -j1.  Add '+' to parent make rule.
make[1]: Entering directory '/home/runner/work/ovn/ovn'
make[1]: Nothing to be done for 'am--depfiles'.
make[1]: Leaving directory '/home/runner/work/ovn/ovn'
config.status:1644: $? = 0
##[error]Process completed with exit code 1.
####################################################################################
#### [End job log] "linux gcc --disable-ssl" at step build
####################################################################################




####################################################################################
#### [Begin job log] "linux clang --disable-ssl" at step build
####################################################################################

## ---------------------- ##
## Running config.status. ##
## ---------------------- ##

This file was extended by ovn config.status 21.06.90, which was
generated by GNU Autoconf 2.69.  Invocation command line was

  CONFIG_FILES    = 
  CONFIG_HEADERS  = 
  CONFIG_LINKS    = 
  CONFIG_COMMANDS = 
  $ ./config.status Makefile depfiles

on fv-az180-615

config.status:1311: creating Makefile
config.status:1540: executing depfiles commands
config.status:1640: cd .       && sed -e '/# am--include-marker/d' Makefile         | make -f - am--depfiles
make[1]: warning: jobserver unavailable: using -j1.  Add '+' to parent make rule.
make[1]: Entering directory '/home/runner/work/ovn/ovn'
make[1]: Nothing to be done for 'am--depfiles'.
make[1]: Leaving directory '/home/runner/work/ovn/ovn'
config.status:1645: $? = 0
##[error]Process completed with exit code 1.
####################################################################################
#### [End job log] "linux clang --disable-ssl" at step build
####################################################################################




####################################################################################
#### [Begin job log] "linux gcc system-test" at step build
####################################################################################
reading sources... [ 87%] topics/testing
reading sources... [ 89%] tutorials/ddlog-new-feature
reading sources... [ 91%] tutorials/index
reading sources... [ 92%] tutorials/ovn-interconnection
reading sources... [ 94%] tutorials/ovn-ipsec
reading sources... [ 96%] tutorials/ovn-openstack
reading sources... [ 98%] tutorials/ovn-rbac
reading sources... [100%] tutorials/ovn-sandbox

depbase=`echo lib/extend-table.lo | sed 's|[^/]*$|.deps/&|;s|\.lo$||'`;\
/bin/bash ./libtool  --tag=CC   --mode=compile env REAL_CC="gcc" CHECK="sparse -Wsparse-error -I /home/runner/work/ovn/ovn/ovs/include/sparse -m64 -I /usr/local/include -I /usr/include/x86_64-linux-gnu  " cgcc -target=x86_64 -DHAVE_CONFIG_H -I. -I../..   -I ../../include  -I ../../include -I ../../ovn -I ./include -I ../../lib -I ./lib -I /home/runner/work/ovn/ovn/ovs/include -I /home/runner/work/ovn/ovn/ovs/include -I /home/runner/work/ovn/ovn/ovs/lib -I /home/runner/work/ovn/ovn/ovs/lib -I /home/runner/work/ovn/ovn/ovs -I /home/runner/work/ovn/ovn/ovs    -Wstrict-prototypes -Wall -Wextra -Wno-sign-compare -Wpointer-arith -Wformat -Wformat-security -Wswitch-enum -Wunused-parameter -Wbad-function-cast -Wcast-align -Wstrict-prototypes -Wold-style-definition -Wmissing-prototypes -Wmissing-field-initializers -fno-strict-aliasing -Wswitch-bool -Wlogical-not-parentheses -Wsizeof-array-argument -Wbool-compare -Wshift-negative-value -Wduplicated-cond -Wshadow -Wmultistatement-macros -Wcast-align=strict -Werror -Werror  -g -O2 -MT lib/extend-table.lo -MD -MP -MF $depbase.Tpo -c -o lib/extend-table.lo ../../lib/extend-table.c &&\
mv -f $depbase.Tpo $depbase.Plo

Warning, treated as error:
/home/runner/work/ovn/ovn/ovn-21.06.90/Documentation/topics/index.rst:36:toctree contains reference to nonexisting document 'topics/plug_providers/index'
make[2]: *** [Makefile:3428: docs-check] Error 2
make[2]: *** Waiting for unfinished jobs....
libtool: compile:  env REAL_CC=gcc "CHECK=sparse -Wsparse-error -I /home/runner/work/ovn/ovn/ovs/include/sparse -m64 -I /usr/local/include -I /usr/include/x86_64-linux-gnu  " cgcc -target=x86_64 -DHAVE_CONFIG_H -I. -I../.. -I ../../include -I ../../include -I ../../ovn -I ./include -I ../../lib -I ./lib -I /home/runner/work/ovn/ovn/ovs/include -I /home/runner/work/ovn/ovn/ovs/include -I /home/runner/work/ovn/ovn/ovs/lib -I /home/runner/work/ovn/ovn/ovs/lib -I /home/runner/work/ovn/ovn/ovs -I /home/runner/work/ovn/ovn/ovs -Wstrict-prototypes -Wall -Wextra -Wno-sign-compare -Wpointer-arith -Wformat -Wformat-security -Wswitch-enum -Wunused-parameter -Wbad-function-cast -Wcast-align -Wstrict-prototypes -Wold-style-definition -Wmissing-prototypes -Wmissing-field-initializers -fno-strict-aliasing -Wswitch-bool -Wlogical-not-parentheses -Wsizeof-array-argument -Wbool-compare -Wshift-negative-value -Wduplicated-cond -Wshadow -Wmultistatement-macros -Wcast-align=strict -Werror -Werror -g -O2 -MT lib/extend-table.lo -MD -MP -MF lib/.deps/extend-table.Tpo -c ../../lib/extend-table.c -o lib/extend-table.o
make[2]: Leaving directory '/home/runner/work/ovn/ovn/ovn-21.06.90/_build/sub'
make[1]: Leaving directory '/home/runner/work/ovn/ovn/ovn-21.06.90/_build/sub'
make[1]: *** [Makefile:1476: all] Error 2
make: *** [Makefile:2717: distcheck] Error 1
+ cat '*/_build/sub/tests/testsuite.log'
cat: '*/_build/sub/tests/testsuite.log': No such file or directory
##[error]Process completed with exit code 1.
####################################################################################
#### [End job log] "linux gcc system-test" at step build
####################################################################################




####################################################################################
#### [Begin job log] "linux clang test asan" at step build
####################################################################################
reading sources... [ 80%] topics/integration
reading sources... [ 82%] topics/ovn-news-2.8
reading sources... [ 83%] topics/plug_providers/plug-providers
reading sources... [ 85%] topics/role-based-access-control
reading sources... [ 87%] topics/testing
reading sources... [ 89%] tutorials/ddlog-new-feature
reading sources... [ 91%] tutorials/index
reading sources... [ 92%] tutorials/ovn-interconnection
reading sources... [ 94%] tutorials/ovn-ipsec
reading sources... [ 96%] tutorials/ovn-openstack
reading sources... [ 98%] tutorials/ovn-rbac
reading sources... [100%] tutorials/ovn-sandbox


Warning, treated as error:
/home/runner/work/ovn/ovn/ovn-21.06.90/Documentation/topics/index.rst:36:toctree contains reference to nonexisting document 'topics/plug_providers/index'
make[2]: *** [Makefile:3428: docs-check] Error 2
make[2]: *** Waiting for unfinished jobs....
make[2]: Leaving directory '/home/runner/work/ovn/ovn/ovn-21.06.90/_build/sub'
make[1]: *** [Makefile:1476: all] Error 2
make[1]: Leaving directory '/home/runner/work/ovn/ovn/ovn-21.06.90/_build/sub'
make: *** [Makefile:2717: distcheck] Error 1
+ cat '*/_build/sub/tests/testsuite.log'
cat: '*/_build/sub/tests/testsuite.log': No such file or directory
##[error]Process completed with exit code 1.
####################################################################################
#### [End job log] "linux clang test asan" at step build
####################################################################################




####################################################################################
#### [Begin job log] "linux gcc test -ljemalloc" at step build
####################################################################################
reading sources... [ 91%] tutorials/index
reading sources... [ 92%] tutorials/ovn-interconnection
reading sources... [ 94%] tutorials/ovn-ipsec
libtool: compile:  env REAL_CC=gcc "CHECK=sparse -Wsparse-error -I /home/runner/work/ovn/ovn/ovs/include/sparse -m64 -I /usr/local/include -I /usr/include/x86_64-linux-gnu  " cgcc -target=x86_64 -DHAVE_CONFIG_H -I. -I../.. -I ../../include -I ../../include -I ../../ovn -I ./include -I ../../lib -I ./lib -I /home/runner/work/ovn/ovn/ovs/include -I /home/runner/work/ovn/ovn/ovs/include -I /home/runner/work/ovn/ovn/ovs/lib -I /home/runner/work/ovn/ovn/ovs/lib -I /home/runner/work/ovn/ovn/ovs -I /home/runner/work/ovn/ovn/ovs -Wstrict-prototypes -Wall -Wextra -Wno-sign-compare -Wpointer-arith -Wformat -Wformat-security -Wswitch-enum -Wunused-parameter -Wbad-function-cast -Wcast-align -Wstrict-prototypes -Wold-style-definition -Wmissing-prototypes -Wmissing-field-initializers -fno-strict-aliasing -Wswitch-bool -Wlogical-not-parentheses -Wsizeof-array-argument -Wbool-compare -Wshift-negative-value -Wduplicated-cond -Wshadow -Wmultistatement-macros -Wcast-align=strict -Werror -Werror -g -O2 -MT lib/features.lo -MD -MP -MF lib/.deps/features.Tpo -c ../../lib/features.c -o lib/features.o
libtool: compile:  env REAL_CC=gcc "CHECK=sparse -Wsparse-error -I /home/runner/work/ovn/ovn/ovs/include/sparse -m64 -I /usr/local/include -I /usr/include/x86_64-linux-gnu  " cgcc -target=x86_64 -DHAVE_CONFIG_H -I. -I../.. -I ../../include -I ../../include -I ../../ovn -I ./include -I ../../lib -I ./lib -I /home/runner/work/ovn/ovn/ovs/include -I /home/runner/work/ovn/ovn/ovs/include -I /home/runner/work/ovn/ovn/ovs/lib -I /home/runner/work/ovn/ovn/ovs/lib -I /home/runner/work/ovn/ovn/ovs -I /home/runner/work/ovn/ovn/ovs -Wstrict-prototypes -Wall -Wextra -Wno-sign-compare -Wpointer-arith -Wformat -Wformat-security -Wswitch-enum -Wunused-parameter -Wbad-function-cast -Wcast-align -Wstrict-prototypes -Wold-style-definition -Wmissing-prototypes -Wmissing-field-initializers -fno-strict-aliasing -Wswitch-bool -Wlogical-not-parentheses -Wsizeof-array-argument -Wbool-compare -Wshift-negative-value -Wduplicated-cond -Wshadow -Wmultistatement-macros -Wcast-align=strict -Werror -Werror -g -O2 -MT lib/extend-table.lo -MD -MP -MF lib/.deps/extend-table.Tpo -c ../../lib/extend-table.c -o lib/extend-table.o
reading sources... [ 96%] tutorials/ovn-openstack
depbase=`echo lib/ovn-parallel-hmap.lo | sed 's|[^/]*$|.deps/&|;s|\.lo$||'`;\
/bin/bash ./libtool  --tag=CC   --mode=compile env REAL_CC="gcc" CHECK="sparse -Wsparse-error -I /home/runner/work/ovn/ovn/ovs/include/sparse -m64 -I /usr/local/include -I /usr/include/x86_64-linux-gnu  " cgcc -target=x86_64 -DHAVE_CONFIG_H -I. -I../..   -I ../../include  -I ../../include -I ../../ovn -I ./include -I ../../lib -I ./lib -I /home/runner/work/ovn/ovn/ovs/include -I /home/runner/work/ovn/ovn/ovs/include -I /home/runner/work/ovn/ovn/ovs/lib -I /home/runner/work/ovn/ovn/ovs/lib -I /home/runner/work/ovn/ovn/ovs -I /home/runner/work/ovn/ovn/ovs    -Wstrict-prototypes -Wall -Wextra -Wno-sign-compare -Wpointer-arith -Wformat -Wformat-security -Wswitch-enum -Wunused-parameter -Wbad-function-cast -Wcast-align -Wstrict-prototypes -Wold-style-definition -Wmissing-prototypes -Wmissing-field-initializers -fno-strict-aliasing -Wswitch-bool -Wlogical-not-parentheses -Wsizeof-array-argument -Wbool-compare -Wshift-negative-value -Wduplicated-cond -Wshadow -Wmultistatement-macros -Wcast-align=strict -Werror -Werror  -g -O2 -MT lib/ovn-parallel-hmap.lo -MD -MP -MF $depbase.Tpo -c -o lib/ovn-parallel-hmap.lo ../../lib/ovn-parallel-hmap.c &&\
mv -f $depbase.Tpo $depbase.Plo
reading sources... [ 98%] tutorials/ovn-rbac
reading sources... [100%] tutorials/ovn-sandbox


Warning, treated as error:
/home/runner/work/ovn/ovn/ovn-21.06.90/Documentation/topics/index.rst:36:toctree contains reference to nonexisting document 'topics/plug_providers/index'
libtool: compile:  env REAL_CC=gcc "CHECK=sparse -Wsparse-error -I /home/runner/work/ovn/ovn/ovs/include/sparse -m64 -I /usr/local/include -I /usr/include/x86_64-linux-gnu  " cgcc -target=x86_64 -DHAVE_CONFIG_H -I. -I../.. -I ../../include -I ../../include -I ../../ovn -I ./include -I ../../lib -I ./lib -I /home/runner/work/ovn/ovn/ovs/include -I /home/runner/work/ovn/ovn/ovs/include -I /home/runner/work/ovn/ovn/ovs/lib -I /home/runner/work/ovn/ovn/ovs/lib -I /home/runner/work/ovn/ovn/ovs -I /home/runner/work/ovn/ovn/ovs -Wstrict-prototypes -Wall -Wextra -Wno-sign-compare -Wpointer-arith -Wformat -Wformat-security -Wswitch-enum -Wunused-parameter -Wbad-function-cast -Wcast-align -Wstrict-prototypes -Wold-style-definition -Wmissing-prototypes -Wmissing-field-initializers -fno-strict-aliasing -Wswitch-bool -Wlogical-not-parentheses -Wsizeof-array-argument -Wbool-compare -Wshift-negative-value -Wduplicated-cond -Wshadow -Wmultistatement-macros -Wcast-align=strict -Werror -Werror -g -O2 -MT lib/ovn-parallel-hmap.lo -MD -MP -MF lib/.deps/ovn-parallel-hmap.Tpo -c ../../lib/ovn-parallel-hmap.c -o lib/ovn-parallel-hmap.o
make[2]: *** [Makefile:3428: docs-check] Error 2
make[2]: *** Waiting for unfinished jobs....
make[2]: Leaving directory '/home/runner/work/ovn/ovn/ovn-21.06.90/_build/sub'
make[1]: Leaving directory '/home/runner/work/ovn/ovn/ovn-21.06.90/_build/sub'
make[1]: *** [Makefile:1476: all] Error 2
make: *** [Makefile:2717: distcheck] Error 1
+ cat '*/_build/sub/tests/testsuite.log'
cat: '*/_build/sub/tests/testsuite.log': No such file or directory
##[error]Process completed with exit code 1.
####################################################################################
#### [End job log] "linux gcc test -ljemalloc" at step build
####################################################################################




####################################################################################
#### [Begin job log] "linux clang test -ljemalloc" at step build
####################################################################################
mv -f $depbase.Tpo $depbase.Plo
reading sources... [100%] tutorials/ovn-sandbox
libtool: compile:  clang -DHAVE_CONFIG_H -I. -I../.. -I ../../include -I ../../include -I ../../ovn -I ./include -I ../../lib -I ./lib -I /home/runner/work/ovn/ovn/ovs/include -I /home/runner/work/ovn/ovn/ovs/include -I /home/runner/work/ovn/ovn/ovs/lib -I /home/runner/work/ovn/ovn/ovs/lib -I /home/runner/work/ovn/ovn/ovs -I /home/runner/work/ovn/ovn/ovs -Wstrict-prototypes -Wall -Wextra -Wno-sign-compare -Wpointer-arith -Wformat -Wformat-security -Wswitch-enum -Wunused-parameter -Wbad-function-cast -Wcast-align -Wstrict-prototypes -Wold-style-definition -Wmissing-prototypes -Wmissing-field-initializers -Wthread-safety -fno-strict-aliasing -Wswitch-bool -Wlogical-not-parentheses -Wsizeof-array-argument -Wshift-negative-value -Qunused-arguments -Wshadow -Wno-null-pointer-arithmetic -Warray-bounds-pointer-arithmetic -Wno-error=unused-command-line-argument -Werror -Werror -g -O2 -MT lib/ovn-l7.lo -MD -MP -MF lib/.deps/ovn-l7.Tpo -c ../../lib/ovn-l7.c -o lib/ovn-l7.o


Warning, treated as error:
/home/runner/work/ovn/ovn/ovn-21.06.90/Documentation/topics/index.rst:36:toctree contains reference to nonexisting document 'topics/plug_providers/index'
depbase=`echo lib/ovn-util.lo | sed 's|[^/]*$|.deps/&|;s|\.lo$||'`;\
/bin/bash ./libtool  --tag=CC   --mode=compile clang -DHAVE_CONFIG_H -I. -I../..   -I ../../include  -I ../../include -I ../../ovn -I ./include -I ../../lib -I ./lib -I /home/runner/work/ovn/ovn/ovs/include -I /home/runner/work/ovn/ovn/ovs/include -I /home/runner/work/ovn/ovn/ovs/lib -I /home/runner/work/ovn/ovn/ovs/lib -I /home/runner/work/ovn/ovn/ovs -I /home/runner/work/ovn/ovn/ovs    -Wstrict-prototypes -Wall -Wextra -Wno-sign-compare -Wpointer-arith -Wformat -Wformat-security -Wswitch-enum -Wunused-parameter -Wbad-function-cast -Wcast-align -Wstrict-prototypes -Wold-style-definition -Wmissing-prototypes -Wmissing-field-initializers -Wthread-safety -fno-strict-aliasing -Wswitch-bool -Wlogical-not-parentheses -Wsizeof-array-argument -Wshift-negative-value -Qunused-arguments -Wshadow -Wno-null-pointer-arithmetic -Warray-bounds-pointer-arithmetic -Wno-error=unused-command-line-argument  -Werror -Werror  -g -O2 -MT lib/ovn-util.lo -MD -MP -MF $depbase.Tpo -c -o lib/ovn-util.lo ../../lib/ovn-util.c &&\
mv -f $depbase.Tpo $depbase.Plo
libtool: compile:  clang -DHAVE_CONFIG_H -I. -I../.. -I ../../include -I ../../include -I ../../ovn -I ./include -I ../../lib -I ./lib -I /home/runner/work/ovn/ovn/ovs/include -I /home/runner/work/ovn/ovn/ovs/include -I /home/runner/work/ovn/ovn/ovs/lib -I /home/runner/work/ovn/ovn/ovs/lib -I /home/runner/work/ovn/ovn/ovs -I /home/runner/work/ovn/ovn/ovs -Wstrict-prototypes -Wall -Wextra -Wno-sign-compare -Wpointer-arith -Wformat -Wformat-security -Wswitch-enum -Wunused-parameter -Wbad-function-cast -Wcast-align -Wstrict-prototypes -Wold-style-definition -Wmissing-prototypes -Wmissing-field-initializers -Wthread-safety -fno-strict-aliasing -Wswitch-bool -Wlogical-not-parentheses -Wsizeof-array-argument -Wshift-negative-value -Qunused-arguments -Wshadow -Wno-null-pointer-arithmetic -Warray-bounds-pointer-arithmetic -Wno-error=unused-command-line-argument -Werror -Werror -g -O2 -MT lib/lex.lo -MD -MP -MF lib/.deps/lex.Tpo -c ../../lib/lex.c -o lib/lex.o
depbase=`echo lib/logical-fields.lo | sed 's|[^/]*$|.deps/&|;s|\.lo$||'`;\
/bin/bash ./libtool  --tag=CC   --mode=compile clang -DHAVE_CONFIG_H -I. -I../..   -I ../../include  -I ../../include -I ../../ovn -I ./include -I ../../lib -I ./lib -I /home/runner/work/ovn/ovn/ovs/include -I /home/runner/work/ovn/ovn/ovs/include -I /home/runner/work/ovn/ovn/ovs/lib -I /home/runner/work/ovn/ovn/ovs/lib -I /home/runner/work/ovn/ovn/ovs -I /home/runner/work/ovn/ovn/ovs    -Wstrict-prototypes -Wall -Wextra -Wno-sign-compare -Wpointer-arith -Wformat -Wformat-security -Wswitch-enum -Wunused-parameter -Wbad-function-cast -Wcast-align -Wstrict-prototypes -Wold-style-definition -Wmissing-prototypes -Wmissing-field-initializers -Wthread-safety -fno-strict-aliasing -Wswitch-bool -Wlogical-not-parentheses -Wsizeof-array-argument -Wshift-negative-value -Qunused-arguments -Wshadow -Wno-null-pointer-arithmetic -Warray-bounds-pointer-arithmetic -Wno-error=unused-command-line-argument  -Werror -Werror  -g -O2 -MT lib/logical-fields.lo -MD -MP -MF $depbase.Tpo -c -o lib/logical-fields.lo ../../lib/logical-fields.c &&\
mv -f $depbase.Tpo $depbase.Plo
libtool: compile:  clang -DHAVE_CONFIG_H -I. -I../.. -I ../../include -I ../../include -I ../../ovn -I ./include -I ../../lib -I ./lib -I /home/runner/work/ovn/ovn/ovs/include -I /home/runner/work/ovn/ovn/ovs/include -I /home/runner/work/ovn/ovn/ovs/lib -I /home/runner/work/ovn/ovn/ovs/lib -I /home/runner/work/ovn/ovn/ovs -I /home/runner/work/ovn/ovn/ovs -Wstrict-prototypes -Wall -Wextra -Wno-sign-compare -Wpointer-arith -Wformat -Wformat-security -Wswitch-enum -Wunused-parameter -Wbad-function-cast -Wcast-align -Wstrict-prototypes -Wold-style-definition -Wmissing-prototypes -Wmissing-field-initializers -Wthread-safety -fno-strict-aliasing -Wswitch-bool -Wlogical-not-parentheses -Wsizeof-array-argument -Wshift-negative-value -Qunused-arguments -Wshadow -Wno-null-pointer-arithmetic -Warray-bounds-pointer-arithmetic -Wno-error=unused-command-line-argument -Werror -Werror -g -O2 -MT lib/ovn-util.lo -MD -MP -MF lib/.deps/ovn-util.Tpo -c ../../lib/ovn-util.c -o lib/ovn-util.o
make[2]: *** [Makefile:3428: docs-check] Error 2
make[2]: *** Waiting for unfinished jobs....
libtool: compile:  clang -DHAVE_CONFIG_H -I. -I../.. -I ../../include -I ../../include -I ../../ovn -I ./include -I ../../lib -I ./lib -I /home/runner/work/ovn/ovn/ovs/include -I /home/runner/work/ovn/ovn/ovs/include -I /home/runner/work/ovn/ovn/ovs/lib -I /home/runner/work/ovn/ovn/ovs/lib -I /home/runner/work/ovn/ovn/ovs -I /home/runner/work/ovn/ovn/ovs -Wstrict-prototypes -Wall -Wextra -Wno-sign-compare -Wpointer-arith -Wformat -Wformat-security -Wswitch-enum -Wunused-parameter -Wbad-function-cast -Wcast-align -Wstrict-prototypes -Wold-style-definition -Wmissing-prototypes -Wmissing-field-initializers -Wthread-safety -fno-strict-aliasing -Wswitch-bool -Wlogical-not-parentheses -Wsizeof-array-argument -Wshift-negative-value -Qunused-arguments -Wshadow -Wno-null-pointer-arithmetic -Warray-bounds-pointer-arithmetic -Wno-error=unused-command-line-argument -Werror -Werror -g -O2 -MT lib/logical-fields.lo -MD -MP -MF lib/.deps/logical-fields.Tpo -c ../../lib/logical-fields.c -o lib/logical-fields.o
make[2]: Leaving directory '/home/runner/work/ovn/ovn/ovn-21.06.90/_build/sub'
make[1]: Leaving directory '/home/runner/work/ovn/ovn/ovn-21.06.90/_build/sub'
make[1]: *** [Makefile:1476: all] Error 2
make: *** [Makefile:2717: distcheck] Error 1
+ cat '*/_build/sub/tests/testsuite.log'
cat: '*/_build/sub/tests/testsuite.log': No such file or directory
##[error]Process completed with exit code 1.
####################################################################################
#### [End job log] "linux clang test -ljemalloc" at step build
####################################################################################




####################################################################################
#### [Begin job log] "linux gcc m32 --disable-ssl" at step build
####################################################################################

## ---------------------- ##
## Running config.status. ##
## ---------------------- ##

This file was extended by ovn config.status 21.06.90, which was
generated by GNU Autoconf 2.69.  Invocation command line was

  CONFIG_FILES    = 
  CONFIG_HEADERS  = 
  CONFIG_LINKS    = 
  CONFIG_COMMANDS = 
  $ ./config.status Makefile depfiles

on fv-az238-949

config.status:1310: creating Makefile
config.status:1539: executing depfiles commands
config.status:1639: cd .       && sed -e '/# am--include-marker/d' Makefile         | make -f - am--depfiles
make[1]: warning: jobserver unavailable: using -j1.  Add '+' to parent make rule.
make[1]: Entering directory '/home/runner/work/ovn/ovn'
make[1]: Nothing to be done for 'am--depfiles'.
make[1]: Leaving directory '/home/runner/work/ovn/ovn'
config.status:1644: $? = 0
##[error]Process completed with exit code 1.
####################################################################################
#### [End job log] "linux gcc m32 --disable-ssl" at step build
####################################################################################
--------------------------------END LOGS-----------------------------


More information about the build mailing list