[ovs-build] |fail| pw1524525 [ovs-dev] [PATCH ovn v4 6/9] lib: Add infrastructure for plugging providers.

0-day Robot robot at bytheb.org
Fri Sep 3 20:20:40 UTC 2021


From: robot at bytheb.org

Test-Label: github-robot: ovn-kubernetes
Test-Status: fail
http://patchwork.ozlabs.org/api/patches/1524525/

_github build: failed_
Build URL: https://github.com/ovsrobot/ovn/actions/runs/1199219756
Build Logs:
-----------------------Summary of failed steps-----------------------
"Build" failed at step Build ovn-kubernetes container
----------------------End summary of failed steps--------------------

-------------------------------BEGIN LOGS----------------------------
####################################################################################
#### [Begin job log] "Build" at step Build ovn-kubernetes container
####################################################################################
reading sources... [100%] tutorials/ovn-sandbox


Warning, treated as error:
/tmp/ovn/rpm/rpmbuild/BUILD/ovn-21.06.90/Documentation/topics/index.rst:36:toctree contains reference to nonexisting document 'topics/plug_providers/index'
make[2]: *** [Makefile:3433: docs-check] Error 2
make[2]: *** Waiting for unfinished jobs....
make[2]: Leaving directory '/tmp/ovn/rpm/rpmbuild/BUILD/ovn-21.06.90'
make[1]: *** [Makefile:1475: all] Error 2
make[1]: Leaving directory '/tmp/ovn/rpm/rpmbuild/BUILD/ovn-21.06.90'


RPM build errors:
error: Bad exit status from /var/tmp/rpm-tmp.y6EzH3 (%build)
    line 33: Possible unexpanded macro in: Obsoletes: openvswitch-ovn-common < 21.06.90-%{release}
    line 34: Possible unexpanded macro in: Provides: openvswitch-ovn-common = 21.06.90-%{release}
    line 81: It's not recommended to have unversioned Obsoletes: Obsoletes: openvswitch-ovn-central
    line 92: It's not recommended to have unversioned Obsoletes: Obsoletes: openvswitch-ovn-host
    line 102: It's not recommended to have unversioned Obsoletes: Obsoletes: openvswitch-ovn-vtep
    line 112: It's not recommended to have unversioned Obsoletes: Obsoletes: openvswitch-ovn-docker
    Bad exit status from /var/tmp/rpm-tmp.y6EzH3 (%build)
make: *** [Makefile:3670: rpm-fedora] Error 1
The command '/bin/sh -c make rpm-fedora' returned a non-zero code: 2

##[error]Process completed with exit code 2.
####################################################################################
#### [End job log] "Build" at step Build ovn-kubernetes container
####################################################################################
--------------------------------END LOGS-----------------------------


More information about the build mailing list