[ovs-build] |fail| pw1528347 [ovs-dev] [OVN Patch v8 3/3] northd: Restore parallel build with dp_groups

0-day Robot robot at bytheb.org
Wed Sep 15 13:41:32 UTC 2021


From: robot at bytheb.org

Test-Label: github-robot: Build and Test
Test-Status: fail
http://patchwork.ozlabs.org/api/patches/1528347/

_github build: failed_
Build URL: https://github.com/ovsrobot/ovn/actions/runs/1237705597
Build Logs:
-----------------------Summary of failed steps-----------------------
"osx clang --disable-ssl" failed at step build
"linux gcc --disable-ssl" failed at step build
"linux clang --disable-ssl" failed at step build
"linux gcc system-test" failed at step build
"linux clang test asan" failed at step build
"linux gcc test -ljemalloc" failed at step build
"linux clang test -ljemalloc" failed at step build
"linux gcc m32 --disable-ssl" failed at step build
----------------------End summary of failed steps--------------------

-------------------------------BEGIN LOGS----------------------------
####################################################################################
#### [Begin job log] "osx clang --disable-ssl" at step build
####################################################################################
#define HAVE_PRAGMA_MESSAGE 1

configure: exit 0

## ---------------------- ##
## Running config.status. ##
## ---------------------- ##

This file was extended by ovn config.status 21.06.90, which was
generated by GNU Autoconf 2.71.  Invocation command line was

  CONFIG_FILES    = 
  CONFIG_HEADERS  = 
  CONFIG_LINKS    = 
  CONFIG_COMMANDS = 
  $ ./config.status Makefile depfiles

on Mac-1631710420953.local

config.status:1303: creating Makefile
config.status:1532: executing depfiles commands
config.status:1634: cd .       && sed -e '/# am--include-marker/d' Makefile         | make -f - am--depfiles
make[1]: Nothing to be done for `am--depfiles'.
config.status:1639: $? = 0
##[error]Process completed with exit code 1.
####################################################################################
#### [End job log] "osx clang --disable-ssl" at step build
####################################################################################




####################################################################################
#### [Begin job log] "linux gcc --disable-ssl" at step build
####################################################################################

## ---------------------- ##
## Running config.status. ##
## ---------------------- ##

This file was extended by ovn config.status 21.06.90, which was
generated by GNU Autoconf 2.69.  Invocation command line was

  CONFIG_FILES    = 
  CONFIG_HEADERS  = 
  CONFIG_LINKS    = 
  CONFIG_COMMANDS = 
  $ ./config.status Makefile depfiles

on fv-az118-898

config.status:1304: creating Makefile
config.status:1533: executing depfiles commands
config.status:1633: cd .       && sed -e '/# am--include-marker/d' Makefile         | make -f - am--depfiles
make[1]: warning: jobserver unavailable: using -j1.  Add '+' to parent make rule.
make[1]: Entering directory '/home/runner/work/ovn/ovn'
make[1]: Nothing to be done for 'am--depfiles'.
make[1]: Leaving directory '/home/runner/work/ovn/ovn'
config.status:1638: $? = 0
##[error]Process completed with exit code 1.
####################################################################################
#### [End job log] "linux gcc --disable-ssl" at step build
####################################################################################




####################################################################################
#### [Begin job log] "linux clang --disable-ssl" at step build
####################################################################################

## ---------------------- ##
## Running config.status. ##
## ---------------------- ##

This file was extended by ovn config.status 21.06.90, which was
generated by GNU Autoconf 2.69.  Invocation command line was

  CONFIG_FILES    = 
  CONFIG_HEADERS  = 
  CONFIG_LINKS    = 
  CONFIG_COMMANDS = 
  $ ./config.status Makefile depfiles

on fv-az163-803

config.status:1305: creating Makefile
config.status:1534: executing depfiles commands
config.status:1634: cd .       && sed -e '/# am--include-marker/d' Makefile         | make -f - am--depfiles
make[1]: warning: jobserver unavailable: using -j1.  Add '+' to parent make rule.
make[1]: Entering directory '/home/runner/work/ovn/ovn'
make[1]: Nothing to be done for 'am--depfiles'.
make[1]: Leaving directory '/home/runner/work/ovn/ovn'
config.status:1639: $? = 0
##[error]Process completed with exit code 1.
####################################################################################
#### [End job log] "linux clang --disable-ssl" at step build
####################################################################################




####################################################################################
#### [Begin job log] "linux gcc system-test" at step build
####################################################################################
depbase=`echo controller/ofctrl.o | sed 's|[^/]*$|.deps/&|;s|\.o$||'`;\
env REAL_CC="gcc" CHECK="sparse -Wsparse-error -I /home/runner/work/ovn/ovn/ovs/include/sparse -m64 -I /usr/local/include -I /usr/include/x86_64-linux-gnu  " cgcc -target=x86_64 -DHAVE_CONFIG_H -I. -I../..   -I ../../include  -I ../../include -I ../../ovn -I ./include -I ../../lib -I ./lib -I /home/runner/work/ovn/ovn/ovs/include -I /home/runner/work/ovn/ovn/ovs/include -I /home/runner/work/ovn/ovn/ovs/lib -I /home/runner/work/ovn/ovn/ovs/lib -I /home/runner/work/ovn/ovn/ovs -I /home/runner/work/ovn/ovn/ovs    -Wstrict-prototypes -Wall -Wextra -Wno-sign-compare -Wpointer-arith -Wformat -Wformat-security -Wswitch-enum -Wunused-parameter -Wbad-function-cast -Wcast-align -Wstrict-prototypes -Wold-style-definition -Wmissing-prototypes -Wmissing-field-initializers -fno-strict-aliasing -Wswitch-bool -Wlogical-not-parentheses -Wsizeof-array-argument -Wbool-compare -Wshift-negative-value -Wduplicated-cond -Wshadow -Wmultistatement-macros -Wcast-align=strict -Werror -Werror  -g -O2 -MT controller/ofctrl.o -MD -MP -MF $depbase.Tpo -c -o controller/ofctrl.o ../../controller/ofctrl.c &&\
mv -f $depbase.Tpo $depbase.Po
depbase=`echo controller/ofctrl-seqno.o | sed 's|[^/]*$|.deps/&|;s|\.o$||'`;\
env REAL_CC="gcc" CHECK="sparse -Wsparse-error -I /home/runner/work/ovn/ovn/ovs/include/sparse -m64 -I /usr/local/include -I /usr/include/x86_64-linux-gnu  " cgcc -target=x86_64 -DHAVE_CONFIG_H -I. -I../..   -I ../../include  -I ../../include -I ../../ovn -I ./include -I ../../lib -I ./lib -I /home/runner/work/ovn/ovn/ovs/include -I /home/runner/work/ovn/ovn/ovs/include -I /home/runner/work/ovn/ovn/ovs/lib -I /home/runner/work/ovn/ovn/ovs/lib -I /home/runner/work/ovn/ovn/ovs -I /home/runner/work/ovn/ovn/ovs    -Wstrict-prototypes -Wall -Wextra -Wno-sign-compare -Wpointer-arith -Wformat -Wformat-security -Wswitch-enum -Wunused-parameter -Wbad-function-cast -Wcast-align -Wstrict-prototypes -Wold-style-definition -Wmissing-prototypes -Wmissing-field-initializers -fno-strict-aliasing -Wswitch-bool -Wlogical-not-parentheses -Wsizeof-array-argument -Wbool-compare -Wshift-negative-value -Wduplicated-cond -Wshadow -Wmultistatement-macros -Wcast-align=strict -Werror -Werror  -g -O2 -MT controller/ofctrl-seqno.o -MD -MP -MF $depbase.Tpo -c -o controller/ofctrl-seqno.o ../../controller/ofctrl-seqno.c &&\
mv -f $depbase.Tpo $depbase.Po
depbase=`echo controller/pinctrl.o | sed 's|[^/]*$|.deps/&|;s|\.o$||'`;\
env REAL_CC="gcc" CHECK="sparse -Wsparse-error -I /home/runner/work/ovn/ovn/ovs/include/sparse -m64 -I /usr/local/include -I /usr/include/x86_64-linux-gnu  " cgcc -target=x86_64 -DHAVE_CONFIG_H -I. -I../..   -I ../../include  -I ../../include -I ../../ovn -I ./include -I ../../lib -I ./lib -I /home/runner/work/ovn/ovn/ovs/include -I /home/runner/work/ovn/ovn/ovs/include -I /home/runner/work/ovn/ovn/ovs/lib -I /home/runner/work/ovn/ovn/ovs/lib -I /home/runner/work/ovn/ovn/ovs -I /home/runner/work/ovn/ovn/ovs    -Wstrict-prototypes -Wall -Wextra -Wno-sign-compare -Wpointer-arith -Wformat -Wformat-security -Wswitch-enum -Wunused-parameter -Wbad-function-cast -Wcast-align -Wstrict-prototypes -Wold-style-definition -Wmissing-prototypes -Wmissing-field-initializers -fno-strict-aliasing -Wswitch-bool -Wlogical-not-parentheses -Wsizeof-array-argument -Wbool-compare -Wshift-negative-value -Wduplicated-cond -Wshadow -Wmultistatement-macros -Wcast-align=strict -Werror -Werror  -g -O2 -MT controller/pinctrl.o -MD -MP -MF $depbase.Tpo -c -o controller/pinctrl.o ../../controller/pinctrl.c &&\
mv -f $depbase.Tpo $depbase.Po
depbase=`echo controller/patch.o | sed 's|[^/]*$|.deps/&|;s|\.o$||'`;\
env REAL_CC="gcc" CHECK="sparse -Wsparse-error -I /home/runner/work/ovn/ovn/ovs/include/sparse -m64 -I /usr/local/include -I /usr/include/x86_64-linux-gnu  " cgcc -target=x86_64 -DHAVE_CONFIG_H -I. -I../..   -I ../../include  -I ../../include -I ../../ovn -I ./include -I ../../lib -I ./lib -I /home/runner/work/ovn/ovn/ovs/include -I /home/runner/work/ovn/ovn/ovs/include -I /home/runner/work/ovn/ovn/ovs/lib -I /home/runner/work/ovn/ovn/ovs/lib -I /home/runner/work/ovn/ovn/ovs -I /home/runner/work/ovn/ovn/ovs    -Wstrict-prototypes -Wall -Wextra -Wno-sign-compare -Wpointer-arith -Wformat -Wformat-security -Wswitch-enum -Wunused-parameter -Wbad-function-cast -Wcast-align -Wstrict-prototypes -Wold-style-definition -Wmissing-prototypes -Wmissing-field-initializers -fno-strict-aliasing -Wswitch-bool -Wlogical-not-parentheses -Wsizeof-array-argument -Wbool-compare -Wshift-negative-value -Wduplicated-cond -Wshadow -Wmultistatement-macros -Wcast-align=strict -Werror -Werror  -g -O2 -MT controller/patch.o -MD -MP -MF $depbase.Tpo -c -o controller/patch.o ../../controller/patch.c &&\
mv -f $depbase.Tpo $depbase.Po
depbase=`echo controller/ovn-controller.o | sed 's|[^/]*$|.deps/&|;s|\.o$||'`;\
env REAL_CC="gcc" CHECK="sparse -Wsparse-error -I /home/runner/work/ovn/ovn/ovs/include/sparse -m64 -I /usr/local/include -I /usr/include/x86_64-linux-gnu  " cgcc -target=x86_64 -DHAVE_CONFIG_H -I. -I../..   -I ../../include  -I ../../include -I ../../ovn -I ./include -I ../../lib -I ./lib -I /home/runner/work/ovn/ovn/ovs/include -I /home/runner/work/ovn/ovn/ovs/include -I /home/runner/work/ovn/ovn/ovs/lib -I /home/runner/work/ovn/ovn/ovs/lib -I /home/runner/work/ovn/ovn/ovs -I /home/runner/work/ovn/ovn/ovs    -Wstrict-prototypes -Wall -Wextra -Wno-sign-compare -Wpointer-arith -Wformat -Wformat-security -Wswitch-enum -Wunused-parameter -Wbad-function-cast -Wcast-align -Wstrict-prototypes -Wold-style-definition -Wmissing-prototypes -Wmissing-field-initializers -fno-strict-aliasing -Wswitch-bool -Wlogical-not-parentheses -Wsizeof-array-argument -Wbool-compare -Wshift-negative-value -Wduplicated-cond -Wshadow -Wmultistatement-macros -Wcast-align=strict -Werror -Werror  -g -O2 -MT controller/ovn-controller.o -MD -MP -MF $depbase.Tpo -c -o controller/ovn-controller.o ../../controller/ovn-controller.c &&\
mv -f $depbase.Tpo $depbase.Po
../../controller/ovn-controller.c:3523:24: error: undefined identifier 'ovsrec_server_has_datapath_table'
make[2]: *** [Makefile:2205: controller/ovn-controller.o] Error 1
make[2]: *** Waiting for unfinished jobs....
make[2]: Leaving directory '/home/runner/work/ovn/ovn/ovn-21.06.90/_build/sub'
make[1]: *** [Makefile:1463: all] Error 2
make[1]: Leaving directory '/home/runner/work/ovn/ovn/ovn-21.06.90/_build/sub'
make: *** [Makefile:2694: distcheck] Error 1
+ cat '*/_build/sub/tests/testsuite.log'
cat: '*/_build/sub/tests/testsuite.log': No such file or directory
##[error]Process completed with exit code 1.
####################################################################################
#### [End job log] "linux gcc system-test" at step build
####################################################################################




####################################################################################
#### [Begin job log] "linux clang test asan" at step build
####################################################################################
depbase=`echo controller/ofctrl-seqno.o | sed 's|[^/]*$|.deps/&|;s|\.o$||'`;\
clang -DHAVE_CONFIG_H -I. -I../..   -I ../../include  -I ../../include -I ../../ovn -I ./include -I ../../lib -I ./lib -I /home/runner/work/ovn/ovn/ovs/include -I /home/runner/work/ovn/ovn/ovs/include -I /home/runner/work/ovn/ovn/ovs/lib -I /home/runner/work/ovn/ovn/ovs/lib -I /home/runner/work/ovn/ovn/ovs -I /home/runner/work/ovn/ovn/ovs    -Wstrict-prototypes -Wall -Wextra -Wno-sign-compare -Wpointer-arith -Wformat -Wformat-security -Wswitch-enum -Wunused-parameter -Wbad-function-cast -Wcast-align -Wstrict-prototypes -Wold-style-definition -Wmissing-prototypes -Wmissing-field-initializers -Wthread-safety -fno-strict-aliasing -Wswitch-bool -Wlogical-not-parentheses -Wsizeof-array-argument -Wshift-negative-value -Qunused-arguments -Wshadow -Wno-null-pointer-arithmetic -Warray-bounds-pointer-arithmetic -fno-omit-frame-pointer -fno-common -Wno-error=unused-command-line-argument -fsanitize=address -Werror -Werror  -g -O2 -MT controller/ofctrl-seqno.o -MD -MP -MF $depbase.Tpo -c -o controller/ofctrl-seqno.o ../../controller/ofctrl-seqno.c &&\
mv -f $depbase.Tpo $depbase.Po
depbase=`echo controller/pinctrl.o | sed 's|[^/]*$|.deps/&|;s|\.o$||'`;\
clang -DHAVE_CONFIG_H -I. -I../..   -I ../../include  -I ../../include -I ../../ovn -I ./include -I ../../lib -I ./lib -I /home/runner/work/ovn/ovn/ovs/include -I /home/runner/work/ovn/ovn/ovs/include -I /home/runner/work/ovn/ovn/ovs/lib -I /home/runner/work/ovn/ovn/ovs/lib -I /home/runner/work/ovn/ovn/ovs -I /home/runner/work/ovn/ovn/ovs    -Wstrict-prototypes -Wall -Wextra -Wno-sign-compare -Wpointer-arith -Wformat -Wformat-security -Wswitch-enum -Wunused-parameter -Wbad-function-cast -Wcast-align -Wstrict-prototypes -Wold-style-definition -Wmissing-prototypes -Wmissing-field-initializers -Wthread-safety -fno-strict-aliasing -Wswitch-bool -Wlogical-not-parentheses -Wsizeof-array-argument -Wshift-negative-value -Qunused-arguments -Wshadow -Wno-null-pointer-arithmetic -Warray-bounds-pointer-arithmetic -fno-omit-frame-pointer -fno-common -Wno-error=unused-command-line-argument -fsanitize=address -Werror -Werror  -g -O2 -MT controller/pinctrl.o -MD -MP -MF $depbase.Tpo -c -o controller/pinctrl.o ../../controller/pinctrl.c &&\
mv -f $depbase.Tpo $depbase.Po
depbase=`echo controller/patch.o | sed 's|[^/]*$|.deps/&|;s|\.o$||'`;\
clang -DHAVE_CONFIG_H -I. -I../..   -I ../../include  -I ../../include -I ../../ovn -I ./include -I ../../lib -I ./lib -I /home/runner/work/ovn/ovn/ovs/include -I /home/runner/work/ovn/ovn/ovs/include -I /home/runner/work/ovn/ovn/ovs/lib -I /home/runner/work/ovn/ovn/ovs/lib -I /home/runner/work/ovn/ovn/ovs -I /home/runner/work/ovn/ovn/ovs    -Wstrict-prototypes -Wall -Wextra -Wno-sign-compare -Wpointer-arith -Wformat -Wformat-security -Wswitch-enum -Wunused-parameter -Wbad-function-cast -Wcast-align -Wstrict-prototypes -Wold-style-definition -Wmissing-prototypes -Wmissing-field-initializers -Wthread-safety -fno-strict-aliasing -Wswitch-bool -Wlogical-not-parentheses -Wsizeof-array-argument -Wshift-negative-value -Qunused-arguments -Wshadow -Wno-null-pointer-arithmetic -Warray-bounds-pointer-arithmetic -fno-omit-frame-pointer -fno-common -Wno-error=unused-command-line-argument -fsanitize=address -Werror -Werror  -g -O2 -MT controller/patch.o -MD -MP -MF $depbase.Tpo -c -o controller/patch.o ../../controller/patch.c &&\
mv -f $depbase.Tpo $depbase.Po
depbase=`echo controller/ovn-controller.o | sed 's|[^/]*$|.deps/&|;s|\.o$||'`;\
clang -DHAVE_CONFIG_H -I. -I../..   -I ../../include  -I ../../include -I ../../ovn -I ./include -I ../../lib -I ./lib -I /home/runner/work/ovn/ovn/ovs/include -I /home/runner/work/ovn/ovn/ovs/include -I /home/runner/work/ovn/ovn/ovs/lib -I /home/runner/work/ovn/ovn/ovs/lib -I /home/runner/work/ovn/ovn/ovs -I /home/runner/work/ovn/ovn/ovs    -Wstrict-prototypes -Wall -Wextra -Wno-sign-compare -Wpointer-arith -Wformat -Wformat-security -Wswitch-enum -Wunused-parameter -Wbad-function-cast -Wcast-align -Wstrict-prototypes -Wold-style-definition -Wmissing-prototypes -Wmissing-field-initializers -Wthread-safety -fno-strict-aliasing -Wswitch-bool -Wlogical-not-parentheses -Wsizeof-array-argument -Wshift-negative-value -Qunused-arguments -Wshadow -Wno-null-pointer-arithmetic -Warray-bounds-pointer-arithmetic -fno-omit-frame-pointer -fno-common -Wno-error=unused-command-line-argument -fsanitize=address -Werror -Werror  -g -O2 -MT controller/ovn-controller.o -MD -MP -MF $depbase.Tpo -c -o controller/ovn-controller.o ../../controller/ovn-controller.c &&\
mv -f $depbase.Tpo $depbase.Po
../../controller/ovn-controller.c:3523:24: error: implicit declaration of function 'ovsrec_server_has_datapath_table' is invalid in C99 [-Werror,-Wimplicit-function-declaration]
                       ovsrec_server_has_datapath_table(ovs_idl_loop.idl)
                       ^
1 error generated.
make[2]: *** [Makefile:2205: controller/ovn-controller.o] Error 1
make[2]: *** Waiting for unfinished jobs....
make[2]: Leaving directory '/home/runner/work/ovn/ovn/ovn-21.06.90/_build/sub'
make[1]: Leaving directory '/home/runner/work/ovn/ovn/ovn-21.06.90/_build/sub'
make[1]: *** [Makefile:1463: all] Error 2
make: *** [Makefile:2694: distcheck] Error 1
+ cat '*/_build/sub/tests/testsuite.log'
cat: '*/_build/sub/tests/testsuite.log': No such file or directory
##[error]Process completed with exit code 1.
####################################################################################
#### [End job log] "linux clang test asan" at step build
####################################################################################




####################################################################################
#### [Begin job log] "linux gcc test -ljemalloc" at step build
####################################################################################
depbase=`echo controller/ofctrl.o | sed 's|[^/]*$|.deps/&|;s|\.o$||'`;\
env REAL_CC="gcc" CHECK="sparse -Wsparse-error -I /home/runner/work/ovn/ovn/ovs/include/sparse -m64 -I /usr/local/include -I /usr/include/x86_64-linux-gnu  " cgcc -target=x86_64 -DHAVE_CONFIG_H -I. -I../..   -I ../../include  -I ../../include -I ../../ovn -I ./include -I ../../lib -I ./lib -I /home/runner/work/ovn/ovn/ovs/include -I /home/runner/work/ovn/ovn/ovs/include -I /home/runner/work/ovn/ovn/ovs/lib -I /home/runner/work/ovn/ovn/ovs/lib -I /home/runner/work/ovn/ovn/ovs -I /home/runner/work/ovn/ovn/ovs    -Wstrict-prototypes -Wall -Wextra -Wno-sign-compare -Wpointer-arith -Wformat -Wformat-security -Wswitch-enum -Wunused-parameter -Wbad-function-cast -Wcast-align -Wstrict-prototypes -Wold-style-definition -Wmissing-prototypes -Wmissing-field-initializers -fno-strict-aliasing -Wswitch-bool -Wlogical-not-parentheses -Wsizeof-array-argument -Wbool-compare -Wshift-negative-value -Wduplicated-cond -Wshadow -Wmultistatement-macros -Wcast-align=strict -Werror -Werror  -g -O2 -MT controller/ofctrl.o -MD -MP -MF $depbase.Tpo -c -o controller/ofctrl.o ../../controller/ofctrl.c &&\
mv -f $depbase.Tpo $depbase.Po
depbase=`echo controller/ofctrl-seqno.o | sed 's|[^/]*$|.deps/&|;s|\.o$||'`;\
env REAL_CC="gcc" CHECK="sparse -Wsparse-error -I /home/runner/work/ovn/ovn/ovs/include/sparse -m64 -I /usr/local/include -I /usr/include/x86_64-linux-gnu  " cgcc -target=x86_64 -DHAVE_CONFIG_H -I. -I../..   -I ../../include  -I ../../include -I ../../ovn -I ./include -I ../../lib -I ./lib -I /home/runner/work/ovn/ovn/ovs/include -I /home/runner/work/ovn/ovn/ovs/include -I /home/runner/work/ovn/ovn/ovs/lib -I /home/runner/work/ovn/ovn/ovs/lib -I /home/runner/work/ovn/ovn/ovs -I /home/runner/work/ovn/ovn/ovs    -Wstrict-prototypes -Wall -Wextra -Wno-sign-compare -Wpointer-arith -Wformat -Wformat-security -Wswitch-enum -Wunused-parameter -Wbad-function-cast -Wcast-align -Wstrict-prototypes -Wold-style-definition -Wmissing-prototypes -Wmissing-field-initializers -fno-strict-aliasing -Wswitch-bool -Wlogical-not-parentheses -Wsizeof-array-argument -Wbool-compare -Wshift-negative-value -Wduplicated-cond -Wshadow -Wmultistatement-macros -Wcast-align=strict -Werror -Werror  -g -O2 -MT controller/ofctrl-seqno.o -MD -MP -MF $depbase.Tpo -c -o controller/ofctrl-seqno.o ../../controller/ofctrl-seqno.c &&\
mv -f $depbase.Tpo $depbase.Po
depbase=`echo controller/pinctrl.o | sed 's|[^/]*$|.deps/&|;s|\.o$||'`;\
env REAL_CC="gcc" CHECK="sparse -Wsparse-error -I /home/runner/work/ovn/ovn/ovs/include/sparse -m64 -I /usr/local/include -I /usr/include/x86_64-linux-gnu  " cgcc -target=x86_64 -DHAVE_CONFIG_H -I. -I../..   -I ../../include  -I ../../include -I ../../ovn -I ./include -I ../../lib -I ./lib -I /home/runner/work/ovn/ovn/ovs/include -I /home/runner/work/ovn/ovn/ovs/include -I /home/runner/work/ovn/ovn/ovs/lib -I /home/runner/work/ovn/ovn/ovs/lib -I /home/runner/work/ovn/ovn/ovs -I /home/runner/work/ovn/ovn/ovs    -Wstrict-prototypes -Wall -Wextra -Wno-sign-compare -Wpointer-arith -Wformat -Wformat-security -Wswitch-enum -Wunused-parameter -Wbad-function-cast -Wcast-align -Wstrict-prototypes -Wold-style-definition -Wmissing-prototypes -Wmissing-field-initializers -fno-strict-aliasing -Wswitch-bool -Wlogical-not-parentheses -Wsizeof-array-argument -Wbool-compare -Wshift-negative-value -Wduplicated-cond -Wshadow -Wmultistatement-macros -Wcast-align=strict -Werror -Werror  -g -O2 -MT controller/pinctrl.o -MD -MP -MF $depbase.Tpo -c -o controller/pinctrl.o ../../controller/pinctrl.c &&\
mv -f $depbase.Tpo $depbase.Po
depbase=`echo controller/patch.o | sed 's|[^/]*$|.deps/&|;s|\.o$||'`;\
env REAL_CC="gcc" CHECK="sparse -Wsparse-error -I /home/runner/work/ovn/ovn/ovs/include/sparse -m64 -I /usr/local/include -I /usr/include/x86_64-linux-gnu  " cgcc -target=x86_64 -DHAVE_CONFIG_H -I. -I../..   -I ../../include  -I ../../include -I ../../ovn -I ./include -I ../../lib -I ./lib -I /home/runner/work/ovn/ovn/ovs/include -I /home/runner/work/ovn/ovn/ovs/include -I /home/runner/work/ovn/ovn/ovs/lib -I /home/runner/work/ovn/ovn/ovs/lib -I /home/runner/work/ovn/ovn/ovs -I /home/runner/work/ovn/ovn/ovs    -Wstrict-prototypes -Wall -Wextra -Wno-sign-compare -Wpointer-arith -Wformat -Wformat-security -Wswitch-enum -Wunused-parameter -Wbad-function-cast -Wcast-align -Wstrict-prototypes -Wold-style-definition -Wmissing-prototypes -Wmissing-field-initializers -fno-strict-aliasing -Wswitch-bool -Wlogical-not-parentheses -Wsizeof-array-argument -Wbool-compare -Wshift-negative-value -Wduplicated-cond -Wshadow -Wmultistatement-macros -Wcast-align=strict -Werror -Werror  -g -O2 -MT controller/patch.o -MD -MP -MF $depbase.Tpo -c -o controller/patch.o ../../controller/patch.c &&\
mv -f $depbase.Tpo $depbase.Po
depbase=`echo controller/ovn-controller.o | sed 's|[^/]*$|.deps/&|;s|\.o$||'`;\
env REAL_CC="gcc" CHECK="sparse -Wsparse-error -I /home/runner/work/ovn/ovn/ovs/include/sparse -m64 -I /usr/local/include -I /usr/include/x86_64-linux-gnu  " cgcc -target=x86_64 -DHAVE_CONFIG_H -I. -I../..   -I ../../include  -I ../../include -I ../../ovn -I ./include -I ../../lib -I ./lib -I /home/runner/work/ovn/ovn/ovs/include -I /home/runner/work/ovn/ovn/ovs/include -I /home/runner/work/ovn/ovn/ovs/lib -I /home/runner/work/ovn/ovn/ovs/lib -I /home/runner/work/ovn/ovn/ovs -I /home/runner/work/ovn/ovn/ovs    -Wstrict-prototypes -Wall -Wextra -Wno-sign-compare -Wpointer-arith -Wformat -Wformat-security -Wswitch-enum -Wunused-parameter -Wbad-function-cast -Wcast-align -Wstrict-prototypes -Wold-style-definition -Wmissing-prototypes -Wmissing-field-initializers -fno-strict-aliasing -Wswitch-bool -Wlogical-not-parentheses -Wsizeof-array-argument -Wbool-compare -Wshift-negative-value -Wduplicated-cond -Wshadow -Wmultistatement-macros -Wcast-align=strict -Werror -Werror  -g -O2 -MT controller/ovn-controller.o -MD -MP -MF $depbase.Tpo -c -o controller/ovn-controller.o ../../controller/ovn-controller.c &&\
mv -f $depbase.Tpo $depbase.Po
../../controller/ovn-controller.c:3523:24: error: undefined identifier 'ovsrec_server_has_datapath_table'
make[2]: *** [Makefile:2205: controller/ovn-controller.o] Error 1
make[2]: *** Waiting for unfinished jobs....
make[1]: *** [Makefile:1463: all] Error 2
make[2]: Leaving directory '/home/runner/work/ovn/ovn/ovn-21.06.90/_build/sub'
make: *** [Makefile:2694: distcheck] Error 1
+ cat '*/_build/sub/tests/testsuite.log'
make[1]: Leaving directory '/home/runner/work/ovn/ovn/ovn-21.06.90/_build/sub'
cat: '*/_build/sub/tests/testsuite.log': No such file or directory
##[error]Process completed with exit code 1.
####################################################################################
#### [End job log] "linux gcc test -ljemalloc" at step build
####################################################################################




####################################################################################
#### [Begin job log] "linux clang test -ljemalloc" at step build
####################################################################################
depbase=`echo controller/pinctrl.o | sed 's|[^/]*$|.deps/&|;s|\.o$||'`;\
clang -DHAVE_CONFIG_H -I. -I../..   -I ../../include  -I ../../include -I ../../ovn -I ./include -I ../../lib -I ./lib -I /home/runner/work/ovn/ovn/ovs/include -I /home/runner/work/ovn/ovn/ovs/include -I /home/runner/work/ovn/ovn/ovs/lib -I /home/runner/work/ovn/ovn/ovs/lib -I /home/runner/work/ovn/ovn/ovs -I /home/runner/work/ovn/ovn/ovs    -Wstrict-prototypes -Wall -Wextra -Wno-sign-compare -Wpointer-arith -Wformat -Wformat-security -Wswitch-enum -Wunused-parameter -Wbad-function-cast -Wcast-align -Wstrict-prototypes -Wold-style-definition -Wmissing-prototypes -Wmissing-field-initializers -Wthread-safety -fno-strict-aliasing -Wswitch-bool -Wlogical-not-parentheses -Wsizeof-array-argument -Wshift-negative-value -Qunused-arguments -Wshadow -Wno-null-pointer-arithmetic -Warray-bounds-pointer-arithmetic -Wno-error=unused-command-line-argument  -Werror -Werror  -g -O2 -MT controller/pinctrl.o -MD -MP -MF $depbase.Tpo -c -o controller/pinctrl.o ../../controller/pinctrl.c &&\
mv -f $depbase.Tpo $depbase.Po
depbase=`echo controller/patch.o | sed 's|[^/]*$|.deps/&|;s|\.o$||'`;\
clang -DHAVE_CONFIG_H -I. -I../..   -I ../../include  -I ../../include -I ../../ovn -I ./include -I ../../lib -I ./lib -I /home/runner/work/ovn/ovn/ovs/include -I /home/runner/work/ovn/ovn/ovs/include -I /home/runner/work/ovn/ovn/ovs/lib -I /home/runner/work/ovn/ovn/ovs/lib -I /home/runner/work/ovn/ovn/ovs -I /home/runner/work/ovn/ovn/ovs    -Wstrict-prototypes -Wall -Wextra -Wno-sign-compare -Wpointer-arith -Wformat -Wformat-security -Wswitch-enum -Wunused-parameter -Wbad-function-cast -Wcast-align -Wstrict-prototypes -Wold-style-definition -Wmissing-prototypes -Wmissing-field-initializers -Wthread-safety -fno-strict-aliasing -Wswitch-bool -Wlogical-not-parentheses -Wsizeof-array-argument -Wshift-negative-value -Qunused-arguments -Wshadow -Wno-null-pointer-arithmetic -Warray-bounds-pointer-arithmetic -Wno-error=unused-command-line-argument  -Werror -Werror  -g -O2 -MT controller/patch.o -MD -MP -MF $depbase.Tpo -c -o controller/patch.o ../../controller/patch.c &&\
mv -f $depbase.Tpo $depbase.Po
depbase=`echo controller/ovn-controller.o | sed 's|[^/]*$|.deps/&|;s|\.o$||'`;\
clang -DHAVE_CONFIG_H -I. -I../..   -I ../../include  -I ../../include -I ../../ovn -I ./include -I ../../lib -I ./lib -I /home/runner/work/ovn/ovn/ovs/include -I /home/runner/work/ovn/ovn/ovs/include -I /home/runner/work/ovn/ovn/ovs/lib -I /home/runner/work/ovn/ovn/ovs/lib -I /home/runner/work/ovn/ovn/ovs -I /home/runner/work/ovn/ovn/ovs    -Wstrict-prototypes -Wall -Wextra -Wno-sign-compare -Wpointer-arith -Wformat -Wformat-security -Wswitch-enum -Wunused-parameter -Wbad-function-cast -Wcast-align -Wstrict-prototypes -Wold-style-definition -Wmissing-prototypes -Wmissing-field-initializers -Wthread-safety -fno-strict-aliasing -Wswitch-bool -Wlogical-not-parentheses -Wsizeof-array-argument -Wshift-negative-value -Qunused-arguments -Wshadow -Wno-null-pointer-arithmetic -Warray-bounds-pointer-arithmetic -Wno-error=unused-command-line-argument  -Werror -Werror  -g -O2 -MT controller/ovn-controller.o -MD -MP -MF $depbase.Tpo -c -o controller/ovn-controller.o ../../controller/ovn-controller.c &&\
mv -f $depbase.Tpo $depbase.Po
depbase=`echo controller/physical.o | sed 's|[^/]*$|.deps/&|;s|\.o$||'`;\
clang -DHAVE_CONFIG_H -I. -I../..   -I ../../include  -I ../../include -I ../../ovn -I ./include -I ../../lib -I ./lib -I /home/runner/work/ovn/ovn/ovs/include -I /home/runner/work/ovn/ovn/ovs/include -I /home/runner/work/ovn/ovn/ovs/lib -I /home/runner/work/ovn/ovn/ovs/lib -I /home/runner/work/ovn/ovn/ovs -I /home/runner/work/ovn/ovn/ovs    -Wstrict-prototypes -Wall -Wextra -Wno-sign-compare -Wpointer-arith -Wformat -Wformat-security -Wswitch-enum -Wunused-parameter -Wbad-function-cast -Wcast-align -Wstrict-prototypes -Wold-style-definition -Wmissing-prototypes -Wmissing-field-initializers -Wthread-safety -fno-strict-aliasing -Wswitch-bool -Wlogical-not-parentheses -Wsizeof-array-argument -Wshift-negative-value -Qunused-arguments -Wshadow -Wno-null-pointer-arithmetic -Warray-bounds-pointer-arithmetic -Wno-error=unused-command-line-argument  -Werror -Werror  -g -O2 -MT controller/physical.o -MD -MP -MF $depbase.Tpo -c -o controller/physical.o ../../controller/physical.c &&\
mv -f $depbase.Tpo $depbase.Po
../../controller/ovn-controller.c:3523:24: error: implicit declaration of function 'ovsrec_server_has_datapath_table' is invalid in C99 [-Werror,-Wimplicit-function-declaration]
                       ovsrec_server_has_datapath_table(ovs_idl_loop.idl)
                       ^
1 error generated.
make[2]: *** [Makefile:2205: controller/ovn-controller.o] Error 1
make[2]: *** Waiting for unfinished jobs....
make[2]: Leaving directory '/home/runner/work/ovn/ovn/ovn-21.06.90/_build/sub'
make[1]: *** [Makefile:1463: all] Error 2
make[1]: Leaving directory '/home/runner/work/ovn/ovn/ovn-21.06.90/_build/sub'
make: *** [Makefile:2694: distcheck] Error 1
+ cat '*/_build/sub/tests/testsuite.log'
cat: '*/_build/sub/tests/testsuite.log': No such file or directory
##[error]Process completed with exit code 1.
####################################################################################
#### [End job log] "linux clang test -ljemalloc" at step build
####################################################################################




####################################################################################
#### [Begin job log] "linux gcc m32 --disable-ssl" at step build
####################################################################################

## ---------------------- ##
## Running config.status. ##
## ---------------------- ##

This file was extended by ovn config.status 21.06.90, which was
generated by GNU Autoconf 2.69.  Invocation command line was

  CONFIG_FILES    = 
  CONFIG_HEADERS  = 
  CONFIG_LINKS    = 
  CONFIG_COMMANDS = 
  $ ./config.status Makefile depfiles

on fv-az243-170

config.status:1304: creating Makefile
config.status:1533: executing depfiles commands
config.status:1633: cd .       && sed -e '/# am--include-marker/d' Makefile         | make -f - am--depfiles
make[1]: warning: jobserver unavailable: using -j1.  Add '+' to parent make rule.
make[1]: Entering directory '/home/runner/work/ovn/ovn'
make[1]: Nothing to be done for 'am--depfiles'.
make[1]: Leaving directory '/home/runner/work/ovn/ovn'
config.status:1638: $? = 0
##[error]Process completed with exit code 1.
####################################################################################
#### [End job log] "linux gcc m32 --disable-ssl" at step build
####################################################################################
--------------------------------END LOGS-----------------------------


More information about the build mailing list