[ovs-build] |fail| pw1529663 [ovs-dev] [PATCH v5 3/3] conntrack: limit port clash resolution attempts

0-day Robot robot at bytheb.org
Sat Sep 18 14:01:04 UTC 2021


From: robot at bytheb.org

Test-Label: github-robot: Build and Test
Test-Status: fail
http://patchwork.ozlabs.org/api/patches/1529663/

_github build: failed_
Build URL: https://github.com/ovsrobot/ovs/actions/runs/1248608042
Build Logs:
-----------------------Summary of failed steps-----------------------
"linux clang test 3.16 asan" failed at step build
----------------------End summary of failed steps--------------------

-------------------------------BEGIN LOGS----------------------------
####################################################################################
#### [Begin job log] "linux clang test 3.16 asan" at step build
####################################################################################

Please send `tests/testsuite.log' and all information you think might help:

   To: <bugs at openvswitch.org>
   Subject: [openvswitch 2.16.90] testsuite: 1088 failed

You may investigate any problem if you feel able to do so, in which
case the test suite provides a good starting point.  Its output may
be found below `tests/testsuite.dir'.

Makefile:6006: recipe for target 'check-local' failed
make[4]: *** [check-local] Error 1
make[4]: Leaving directory '/home/runner/work/ovs/ovs/openvswitch-2.16.90/_build/sub'
Makefile:5435: recipe for target 'check-am' failed
make[3]: *** [check-am] Error 2
make[3]: Leaving directory '/home/runner/work/ovs/ovs/openvswitch-2.16.90/_build/sub'
make[2]: *** [check-recursive] Error 1
Makefile:5144: recipe for target 'check-recursive' failed
make[1]: *** [check] Error 2
make[2]: Leaving directory '/home/runner/work/ovs/ovs/openvswitch-2.16.90/_build/sub'
Makefile:5438: recipe for target 'check' failed
make[1]: Leaving directory '/home/runner/work/ovs/ovs/openvswitch-2.16.90/_build/sub'
make: *** [distcheck] Error 1
Makefile:5353: recipe for target 'distcheck' failed
##[error]Process completed with exit code 2.
####################################################################################
#### [End job log] "linux clang test 3.16 asan" at step build
####################################################################################
--------------------------------END LOGS-----------------------------


More information about the build mailing list