[ovs-dev] ovs python: ovs.stream.open_block() returns success even if the remote is unreachable

Numan Siddique nusiddiq at redhat.com
Mon Jul 2 17:50:08 UTC 2018


On Mon, Jul 2, 2018, 10:25 PM 0-day Robot <robot at bytheb.org> wrote:

> Bleep bloop.  Greetings Numan Siddique, I am a robot and I have tried out
> your patch.
> Thanks for your contribution.
>
> I encountered some error that I wasn't expecting.  See the details below.
>

Thanks Robot.
I thought I fixed this issue. Looks like I didn't commit the code.

v2 will be on its way soon.


>
> build:
> /bin/sh
> /var/lib/jenkins/jobs/upstream_build_from_pw/workspace/build-aux/missing
> autom4te --language=autotest -I '.' -o tests/system-dpdk-testsuite.tmp
> tests/system-dpdk-testsuite.at
> mv tests/system-dpdk-testsuite.tmp tests/system-dpdk-testsuite
> \
> { sed -n -e '/%AUTHORS%/q' -e p < ./debian/copyright.in;   \
>   sed '34,/^$/d' ./AUTHORS.rst |                           \
>         sed -n -e '/^$/q' -e 's/^/  /p';                           \
>   sed -e '34,/%AUTHORS%/d' ./debian/copyright.in;          \
> } > debian/copyright
> (printf '\043 Generated automatically -- do not modify!    -*-
> buffer-read-only: t -*-\n' && sed -e 's,[@]VERSION[@],2.9.90,g') < ./rhel/
> openvswitch-dkms.spec.in > openvswitch-dkms.spec.tmp || exit 1; if cmp -s
> openvswitch-dkms.spec.tmp rhel/openvswitch-dkms.spec; then touch
> rhel/openvswitch-dkms.spec; rm openvswitch-dkms.spec.tmp; else mv
> openvswitch-dkms.spec.tmp rhel/openvswitch-dkms.spec; fi
> (printf '\043 Generated automatically -- do not modify!    -*-
> buffer-read-only: t -*-\n' && sed -e 's,[@]VERSION[@],2.9.90,g') < ./rhel/
> openvswitch-kmod-rhel6.spec.in > openvswitch-kmod-rhel6.spec.tmp || exit
> 1; if cmp -s openvswitch-kmod-rhel6.spec.tmp
> rhel/openvswitch-kmod-rhel6.spec; then touch
> rhel/openvswitch-kmod-rhel6.spec; rm openvswitch-kmod-rhel6.spec.tmp; else
> mv openvswitch-kmod-rhel6.spec.tmp rhel/openvswitch-kmod-rhel6.spec; fi
> (printf '\043 Generated automatically -- do not modify!    -*-
> buffer-read-only: t -*-\n' && sed -e 's,[@]VERSION[@],2.9.90,g') < ./rhel/
> openvswitch-kmod-fedora.spec.in > openvswitch-kmod-fedora.spec.tmp ||
> exit 1; if cmp -s openvswitch-kmod-fedora.spec.tmp
> rhel/openvswitch-kmod-fedora.spec; then touch
> rhel/openvswitch-kmod-fedora.spec; rm openvswitch-kmod-fedora.spec.tmp;
> else mv openvswitch-kmod-fedora.spec.tmp rhel/openvswitch-kmod-fedora.spec;
> fi
> (printf '\043 Generated automatically -- do not modify!    -*-
> buffer-read-only: t -*-\n' && sed -e 's,[@]VERSION[@],2.9.90,g') < ./rhel/
> openvswitch.spec.in > openvswitch.spec.tmp || exit 1; if cmp -s
> openvswitch.spec.tmp rhel/openvswitch.spec; then touch
> rhel/openvswitch.spec; rm openvswitch.spec.tmp; else mv
> openvswitch.spec.tmp rhel/openvswitch.spec; fi
> (printf '\043 Generated automatically -- do not modify!    -*-
> buffer-read-only: t -*-\n' && sed -e 's,[@]VERSION[@],2.9.90,g') < ./rhel/
> openvswitch-fedora.spec.in > openvswitch-fedora.spec.tmp || exit 1; if
> cmp -s openvswitch-fedora.spec.tmp rhel/openvswitch-fedora.spec; then touch
> rhel/openvswitch-fedora.spec; rm openvswitch-fedora.spec.tmp; else mv
> openvswitch-fedora.spec.tmp rhel/openvswitch-fedora.spec; fi
> (printf '\043 Generated automatically -- do not modify!    -*-
> buffer-read-only: t -*-\n' && sed -e 's,[@]VERSION[@],2.9.90,g') \
>         < ./xenserver/openvswitch-xen.spec.in > openvswitch-xen.spec.tmp
> || exit 1; \
> if cmp -s openvswitch-xen.spec.tmp xenserver/openvswitch-xen.spec; then
> touch xenserver/openvswitch-xen.spec; rm openvswitch-xen.spec.tmp; else mv
> openvswitch-xen.spec.tmp xenserver/openvswitch-xen.spec; fi
> make[3]: Entering directory
> `/var/lib/jenkins/jobs/upstream_build_from_pw/workspace/datapath'
> make[3]: Leaving directory
> `/var/lib/jenkins/jobs/upstream_build_from_pw/workspace/datapath'
> The following files are in git but not the distribution:
> tests/test-stream.py
> make[2]: *** [dist-hook-git] Error 1
> make[2]: Leaving directory
> `/var/lib/jenkins/jobs/upstream_build_from_pw/workspace'
> make[1]: *** [all-recursive] Error 1
> make[1]: Leaving directory
> `/var/lib/jenkins/jobs/upstream_build_from_pw/workspace'
> make: *** [all] Error 2
>
>
> Please check this out.  If you feel there has been an error, please email
> aconole at bytheb.org
>
> Thanks,
> 0-day Robot
>


More information about the dev mailing list