[ovs-dev] Automated robotic reply. Re: *

0-day Robot robot at bytheb.org
Tue Jun 26 11:24:06 UTC 2018

Bleep bloop.  Greetings Manohar Krishnappa Chidambaraswamy, I am a robot and I have tried out your patch
with message ID 
Thanks for your contribution.

I encountered a 'make distcheck' failure. See the details below.
2613: mcast - check multicasts to trunk ports are not duplicated ok
2614: mcast - delete the port mdb when vlan configuration changed ok
2615: mcast - delete the port mdb when port destroyed ok

packet-type-aware pipeline

2616: ptap - legal flow entries in ptap bridge        ok
2617: ptap - triangle bridge setup with L2 and L3 GRE tunnels ok
2618: ptap - check decap() prerequisits               ok
2619: ptap - check encap/decap VLAN tagged Ethernet frame ok
2620: ptap - L3 over patch port                       ok
2621: ptap - recirculate after packet_type change     ok

network service header (NSH)

2622: nsh - matching                                  ok
2623: nsh - md1 encap over a veth link                ok
2624: nsh - md2 encap over a veth link                ok
2625: nsh - double encap over veth link using groups  ok
2626: nsh - triangle PTAP bridge setup with NSH over vxlan-gpe ok

## ------------- ##
## Test results. ##
## ------------- ##

ERROR: 2183 tests were run,
1 failed unexpectedly.
347 tests were skipped.
## -------------------------- ##
## testsuite.log was created. ##
## -------------------------- ##

Please send `tests/testsuite.log' and all information you think might help:

   To: <bugs at openvswitch.org>
   Subject: [openvswitch 2.9.90] testsuite: 454 failed

You may investigate any problem if you feel able to do so, in which
case the test suite provides a good starting point.  Its output may
be found below `tests/testsuite.dir'.

make[4]: *** [check-local] Error 1
make[4]: Leaving directory `/var/lib/jenkins/jobs/upstream_build_from_pw/workspace/openvswitch-2.9.90/_build'
make[3]: *** [check-am] Error 2
make[3]: Leaving directory `/var/lib/jenkins/jobs/upstream_build_from_pw/workspace/openvswitch-2.9.90/_build'
make[2]: *** [check-recursive] Error 1
make[2]: Leaving directory `/var/lib/jenkins/jobs/upstream_build_from_pw/workspace/openvswitch-2.9.90/_build'
make[1]: *** [check] Error 2
make[1]: Leaving directory `/var/lib/jenkins/jobs/upstream_build_from_pw/workspace/openvswitch-2.9.90/_build'
make: *** [distcheck] Error 1

Please check this out.  If you feel there has been an error, please email aconole at bytheb.org

0-day Robot

More information about the dev mailing list